Pentyl 4-aminobenzoate
- Formula: C12H17NO2
- Molecular weight: 207.2689
- IUPAC Standard InChIKey: VKYWCHMXHQTCJQ-UHFFFAOYSA-N
- CAS Registry Number: 13110-37-7
- Chemical structure:
View 3d structure (requires JavaScript / HTML 5) - Species with the same structure:

Phase change data

Data compiled as indicated in comments:
TRC - Thermodynamics Research Center, NIST Boulder Laboratories, Chris Muzny director
AC - William E. Acree, Jr., James S. Chickos
Quantity | Value | Units | Method | Reference | Comment |
---|---|---|---|---|---|
Tfus | 326. | K | N/A | Yalkowsky, Flynn, et al., 1972 | Uncertainty assigned by TRC = 1. K; TRC |
Enthalpy of fusion
ΔfusH (kJ/mol) | Temperature (K) | Reference | Comment |
---|---|---|---|
23.93 | 325.1 | Acree, 1991 | AC |

References

Yalkowsky, Flynn, et al., 1972
Yalkowsky, S.H.; Flynn, G.L.; Slunick, T.G.,
Importance of chain length on physicochemical and crystalline properties of organic homologs,
J. Pharm. Sci., 1972, 61, 852. [all data]
Acree, 1991
Acree, William E.,
Thermodynamic properties of organic compounds: enthalpy of fusion and melting point temperature compilation,
Thermochimica Acta, 1991, 189, 1, 37-56, https://doi.org/10.1016/0040-6031(91)87098-H
. [all data]