lithium hydroxide
- Formula: HLiO
- Molecular weight: 23.948
- CAS Registry Number: 1310-65-2

Condensed phase thermochemistry data

Quantity | Value | Units | Method | Reference | Comment |
---|---|---|---|---|---|
ΔfH°liquid | -113.39 | kcal/mol | Review | Chase, 1998 | Data last reviewed in June, 1971 |
Quantity | Value | Units | Method | Reference | Comment |
S°liquid,1 bar | 11.47 | cal/mol*K | Review | Chase, 1998 | Data last reviewed in June, 1971 |
Quantity | Value | Units | Method | Reference | Comment |
ΔfH°solid | -115.90 | kcal/mol | Review | Chase, 1998 | Data last reviewed in June, 1971 |
Quantity | Value | Units | Method | Reference | Comment |
S°solid | 10.23 | cal/mol*K | Review | Chase, 1998 | Data last reviewed in June, 1971 |
Liquid Phase Heat Capacity (Shomate Equation)
Cp° = A + B*t + C*t2 + D*t3 +
E/t2
H° − H°298.15= A*t + B*t2/2 +
C*t3/3 + D*t4/4 − E/t + F − H
S° = A*ln(t) + B*t + C*t2/2 + D*t3/3 −
E/(2*t2) + G
Cp = heat capacity (cal/mol*K)
H° = standard enthalpy (kcal/mol)
S° = standard entropy (cal/mol*K)
t = temperature (K) / 1000.
View plot Requires a JavaScript / HTML 5 canvas capable browser.
Temperature (K) | 744.3 to 2500. |
---|---|
A | 20.81410 |
B | -1.700381×10-9 |
C | 1.163011×10-9 |
D | -2.471552×10-10 |
E | -3.471881×10-11 |
F | -119.5950 |
G | 36.65311 |
H | -113.3900 |
Reference | Chase, 1998 |
Comment | Data last reviewed in June, 1971 |
Solid Phase Heat Capacity (Shomate Equation)
Cp° = A + B*t + C*t2 + D*t3 +
E/t2
H° − H°298.15= A*t + B*t2/2 +
C*t3/3 + D*t4/4 − E/t + F − H
S° = A*ln(t) + B*t + C*t2/2 + D*t3/3 −
E/(2*t2) + G
Cp = heat capacity (cal/mol*K)
H° = standard enthalpy (kcal/mol)
S° = standard entropy (cal/mol*K)
t = temperature (K) / 1000.
View plot Requires a JavaScript / HTML 5 canvas capable browser.
Temperature (K) | 298. to 744.3 |
---|---|
A | 12.28350 |
B | 7.738841 |
C | 0.188633 |
D | -0.055046 |
E | -0.245100 |
F | -120.7310 |
G | 21.40400 |
H | -115.9000 |
Reference | Chase, 1998 |
Comment | Data last reviewed in June, 1971 |

Reaction thermochemistry data

Data compiled by: José A. Martinho Simões
Individual Reactions
C4H9Li (l) + (g) =
(g) + HLiO (cr)
By formula: C4H9Li (l) + H2O (g) = C4H10 (g) + HLiO (cr)
Quantity | Value | Units | Method | Reference | Comment |
---|---|---|---|---|---|
ΔrH° | -57.41 ± 0.69 | kcal/mol | RSC | Fowell and Mortimer, 1961 | Please also see Pedley and Rylance, 1977 and Cox and Pilcher, 1970. |
CH3LiO (cr) + (l) = HLiO (cr) +
(l)
By formula: CH3LiO (cr) + H2O (l) = HLiO (cr) + CH4O (l)
Quantity | Value | Units | Method | Reference | Comment |
---|---|---|---|---|---|
ΔrH° | -1.2 ± 0.55 | kcal/mol | RSC | Leal and Martinho Simões, 1993 |
C2H5LiO (cr) + (l) = HLiO (cr) +
(l)
By formula: C2H5LiO (cr) + H2O (l) = HLiO (cr) + C2H6O (l)
Quantity | Value | Units | Method | Reference | Comment |
---|---|---|---|---|---|
ΔrH° | -0.86 ± 0.60 | kcal/mol | RSC | Leal and Martinho Simões, 1993 |

Gas phase thermochemistry data

Quantity Value Units Method Reference Comment
Δfgas-234.30kJ/molReviewChase, 1998Data last reviewed in June, 1971
Quantity Value Units Method Reference Comment
gas,1 bar210.67J/mol*KReviewChase, 1998Data last reviewed in June, 1971

Gas Phase Heat Capacity (Shomate Equation)

Cp° = A + B*t + C*t2 + D*t3 + E/t2
H° − H°298.15= A*t + B*t2/2 + C*t3/3 + D*t4/4 − E/t + F − H
S° = A*ln(t) + B*t + C*t2/2 + D*t3/3 − E/(2*t2) + G
    Cp = heat capacity (J/mol*K)
    H° = standard enthalpy (kJ/mol)
    S° = standard entropy (J/mol*K)
    t = temperature (K) / 1000.

View plot Requires a JavaScript / HTML 5 canvas capable browser.

View table.

Temperature (K) 2500. - 6000.
A 48.84611
B 7.496264
C -1.522755
D 0.106244
E -0.421676
F -250.6061
G 265.2388
H -234.3044
ReferenceChase, 1998
Comment Data last reviewed in June, 1971

References

Chase, 1998
Chase, M.W., Jr.,
NIST-JANAF Themochemical Tables, Fourth Edition,
J. Phys. Chem. Ref. Data, Monograph 9, 1998, 1-1951. [all data]