magnesium hydroxide
- Formula: H2MgO2
- Molecular weight: 58.3197
- CAS Registry Number: 1309-42-8

Gas phase thermochemistry data

Quantity | Value | Units | Method | Reference | Comment |
---|---|---|---|---|---|
ΔfH°gas | -572.37 | kJ/mol | Review | Chase, 1998 | Data last reviewed in December, 1975 |
Quantity | Value | Units | Method | Reference | Comment |
S°gas,1 bar | 267.26 | J/mol*K | Review | Chase, 1998 | Data last reviewed in December, 1975 |
Gas Phase Heat Capacity (Shomate Equation)
Cp° = A + B*t + C*t2 + D*t3 +
E/t2
H° − H°298.15= A*t + B*t2/2 +
C*t3/3 + D*t4/4 − E/t + F − H
S° = A*ln(t) + B*t + C*t2/2 + D*t3/3 −
E/(2*t2) + G
Cp = heat capacity (J/mol*K)
H° = standard enthalpy (kJ/mol)
S° = standard entropy (J/mol*K)
t = temperature (K) / 1000.
View plot Requires a JavaScript / HTML 5 canvas capable browser.
Temperature (K) | 298. to 1800. | 1800. to 6000. |
---|---|---|
A | 80.46669 | 97.35206 |
B | 13.02032 | 4.752898 |
C | -0.581735 | -0.799320 |
D | -0.420316 | 0.047740 |
E | -1.323667 | -14.58568 |
F | -601.3789 | -626.5498 |
G | 353.3350 | 355.6898 |
H | -572.3712 | -572.3712 |
Reference | Chase, 1998 | Chase, 1998 |
Comment | Data last reviewed in December, 1975 | Data last reviewed in December, 1975 |

Condensed phase thermochemistry data

Quantity | Value | Units | Method | Reference | Comment |
---|---|---|---|---|---|
ΔfH°solid | -924.66 | kJ/mol | Review | Chase, 1998 | Data last reviewed in December, 1975 |
Quantity | Value | Units | Method | Reference | Comment |
S°solid | 63.18 | J/mol*K | Review | Chase, 1998 | Data last reviewed in December, 1975 |
Solid Phase Heat Capacity (Shomate Equation)
Cp° = A + B*t + C*t2 + D*t3 +
E/t2
H° − H°298.15= A*t + B*t2/2 +
C*t3/3 + D*t4/4 − E/t + F − H
S° = A*ln(t) + B*t + C*t2/2 + D*t3/3 −
E/(2*t2) + G
Cp = heat capacity (J/mol*K)
H° = standard enthalpy (kJ/mol)
S° = standard entropy (J/mol*K)
t = temperature (K) / 1000.
View plot Requires a JavaScript / HTML 5 canvas capable browser.
Temperature (K) | 298. to 1000. |
---|---|
A | 84.90340 |
B | 74.44005 |
C | -68.92805 |
D | 26.63242 |
E | -2.174907 |
F | -960.0439 |
G | 134.3269 |
H | -924.6640 |
Reference | Chase, 1998 |
Comment | Data last reviewed in December, 1975 |

References

Chase, 1998
Chase, M.W., Jr.,
NIST-JANAF Themochemical Tables, Fourth Edition,
J. Phys. Chem. Ref. Data, Monograph 9, 1998, 1-1951. [all data]