magnetite

Condensed phase thermochemistry data

Quantity Value Units Method Reference Comment
Δfsolid-1120.89kJ/molReviewChase, 1998magnetite phase; Data last reviewed in June, 1965

Solid Phase Heat Capacity (Shomate Equation)

Cp° = A + B*t + C*t2 + D*t3 + E/t2
H° − H°298.15= A*t + B*t2/2 + C*t3/3 + D*t4/4 − E/t + F − H
S° = A*ln(t) + B*t + C*t2/2 + D*t3/3 − E/(2*t2) + G
    Cp = heat capacity (J/mol*K)
    H° = standard enthalpy (kJ/mol)
    S° = standard entropy (J/mol*K)
    t = temperature (K) / 1000.

View plot Requires a JavaScript / HTML 5 canvas capable browser.

View table.

Temperature (K) 298. - 900.900. - 3000.
A 104.2096200.8320
B 178.51081.586435×10-7
C 10.61510-6.661682×10-8
D 1.1325349.452452×10-9
E -0.9942023.186020×10-8
F -1163.336-1174.135
G 212.0585388.0790
H -1120.894-1120.894
ReferenceChase, 1998Chase, 1998
Comment magnetite phase; Data last reviewed in June, 1965 magnetite phase; Data last reviewed in June, 1965

References

Chase, 1998
Chase, M.W., Jr., NIST-JANAF Themochemical Tables, Fourth Edition, J. Phys. Chem. Ref. Data, Monograph 9, 1998, 1-1951. [all data]