CAS Reg. No. 130935-18-1
- CAS Registry Number: 130935-18-1

Reaction thermochemistry data

Data compiled by: John E. Bartmess
Individual Reactions
(CAS Reg. No. 130935-18-1 • 4294967295) +
= CAS Reg. No. 130935-18-1
By formula: (CAS Reg. No. 130935-18-1 • 4294967295C3H3F3O) + C3H3F3O = CAS Reg. No. 130935-18-1
Quantity | Value | Units | Method | Reference | Comment |
---|---|---|---|---|---|
ΔrH° | 53.8 ± 2.5 | kcal/mol | N/A | Caldwell, McMahon, et al., 1985 | gas phase; value altered from reference due to change in acidity scale |

References

Caldwell, McMahon, et al., 1985
Caldwell, G.; McMahon, T.B.; Kebarle, P.; Bartmess, J.E.; Kiplinger, J.P.,
Methyl substituent effects in the gas phase acidities of halosubstituted oxygen acids. A realignment with substituent effects in solution,
J. Am. Chem. Soc., 1985, 107, 80. [all data]