Tricyclo(3.3.1.1(3,7))decan-2-amine
- Formula: C10H17N
- Molecular weight: 151.2487
- IUPAC Standard InChIKey: QZWNXXINFABALM-UHFFFAOYSA-N
- CAS Registry Number: 13074-39-0
- Chemical structure:
View 3d structure (requires JavaScript / HTML 5) - Other names: 2-Adamantanamine; 2-Adamantylamine; 2-Aminoadamantane; JP 60

Kovats' RI, non-polar column, isothermal

Column type | Active phase | Temperature (C) | I | Reference | Comment |
---|---|---|---|---|---|
Packed | OV-101 | 200. | 1360. | Kurbatova, Yashkin, et al., 1999 | N2, Chromaton N-AW; Column length: 1. m |
Packed | Apiezon L | 200. | 1310. | Kurbatova, Yashkin, et al., 1999 | N2, Chromaton N-AW; Column length: 1. m |
Packed | OV-101 | 200. | 1360. | Kurbatova, Moiseev, et al., 1998 | Chromaton N-AW; Column length: 1. m |
Packed | Apiezon L | 200. | 1310. | Kurbatova, Moiseev, et al., 1998 | Chromaton N-AW; Column length: 1. m |
Capillary | OV-101 | 200. | 1362. | Suslov, Rudenko, et al., 1988 | N2; Column length: 50. m; Column diameter: 0.25 mm |

Van Den Dool and Kratz RI, non-polar column, custom temperature program

Column type | Active phase | I | Reference | Comment |
---|---|---|---|---|
Capillary | VF-5MS | 1337.3 | Tret'yakov, 2007 | 30. m/0.25 mm/0.25 μm, He; Program: Multi-step temperature program; T(initial)=60C; T(final)=270C |
Capillary | VF-5MS | 1342.9 | Tret'yakov, 2007 | 30. m/0.25 mm/0.25 μm, He; Program: Multi-step temperature program; T(initial)=60C; T(final)=270C |

References

Kurbatova, Yashkin, et al., 1999
Kurbatova, S.V.; Yashkin, S.N.; Moiseev, I.K.; Zemtsova, M.N.,
A study of the cell effect for adamantane derivatives by gas-liquid chromatography,
Russ. J. Phys. Chem. (Engl. Transl.), 1999, 73, 9, 1486-1489. [all data]
Kurbatova, Moiseev, et al., 1998
Kurbatova, S.V.; Moiseev, I.K.; Zemtsova, M.N.; Kudryashov, S.Yu.,
Gas chromatography of aminoadamantanes,
J. Anal. Chem. USSR (Engl. Transl.), 1998, 53, 8, 732-734. [all data]
Suslov, Rudenko, et al., 1988
Suslov, I.A.; Rudenko, B.A.; Arzamastsev, A.P.,
Capillary chromatography of adamantane derivatives,
Zh. Anal. Khim., 1988, 43, 328-332. [all data]
Tret'yakov, 2007
Tret'yakov, K.V.,
Retention Data. NIST Mass Spectrometry Data Center., NIST Mass Spectrometry Data Center, 2007. [all data]