cadmium oxide
- Formula: CdO
- Molecular weight: 128.410
- IUPAC Standard InChIKey: CXKCTMHTOKXKQT-UHFFFAOYSA-N
- CAS Registry Number: 1306-19-0
- Chemical structure:
View 3d structure (requires JavaScript / HTML 5) - Permanent link for this species. Use this link for bookmarking this species for future reference.

Phase change data

Antoine Equation Parameters
log10(P) = A − (B / (T + C))
P = vapor pressure (bar)
T = temperature (K)
View plot Requires a JavaScript / HTML 5 canvas capable browser.
Temperature (K) | A | B | C | Reference | Comment |
---|---|---|---|---|---|
1273. to 1832. | 6.21581 | 10975.976 | -65.47 | Stull, 1947 | Coefficents calculated by NIST from author's data. |

Condensed phase thermochemistry data

Quantity Value Units Method Reference Comment
Δfsolid-258.35 ± 0.40kJ/molReviewCox, Wagman, et al., 1984CODATA Review value
Quantity Value Units Method Reference Comment
solid,1 bar54.8 ± 1.5J/mol*KReviewCox, Wagman, et al., 1984CODATA Review value

References

Stull, 1947
Stull, Daniel R.,
Vapor Pressure of Pure Substances. Organic and Inorganic Compounds,
Ind. Eng. Chem., 1947, 39, 4, 517-540, https://doi.org/10.1021/ie50448a022
. [all data]