Iodomethyl methyl ether
- Formula: C2H5IO
- Molecular weight: 171.9650
- IUPAC Standard InChIKey: UUSXSNJAQDJKCG-UHFFFAOYSA-N
- CAS Registry Number: 13057-19-7
- Chemical structure:
View 3d structure (requires JavaScript / HTML 5) - Permanent link for this species. Use this link for bookmarking this species for future reference.

Gas phase thermochemistry data

Data compiled by: Hussein Y. Afeefy, Joel F. Liebman, and Stephen E. Stein
Quantity | Value | Units | Method | Reference | Comment |
---|---|---|---|---|---|
ΔfH°gas | -29.3 | kcal/mol | Eqk | Cruickshank and Benson, 1969 |

References

Cruickshank and Benson, 1969
Cruickshank, F.R.; Benson, S.W.,
Some thermochemical properties of methyl vinyl ether, α-chloroethyl methyl ether, and iodomethyl methyl ether. Evidence for nonbonded electrostatic interactions,
J. Am. Chem. Soc., 1969, 91, 2487-2490. [all data]