3,3-Diethyl-5-methyl-piperidine-2,4,6-trione
- Formula: C10H15NO3
- Molecular weight: 197.2310
- IUPAC Standard InChIKey: MBJIJGJXNJWDEM-UHFFFAOYSA-N
- CAS Registry Number: 13056-28-5
- Chemical structure:
View 3d structure (requires JavaScript / HTML 5) - Other names: 3,3-Diethyl-5-methyl-2,4,6-piperidinetrione; 6-Oxomethyprylon; Glutarimide, 2,2-diethyl-4-methyl-3-oxo-; Methyprylon M (oxo)

Kovats' RI, non-polar column, temperature ramp

Column type | Active phase | I | Reference | Comment |
---|---|---|---|---|
Packed | SE-30 | 1870. | Maurer, 1990 | N2, 100. C @ 3. min, 30. K/min, 310. C @ 5. min |

References

Maurer, 1990
Maurer, H.H.,
Identification and differentiation of barbiturates, other sedative-hypnotics and their metabolites in urine integrated in a general screening procedure using computerized gas chromatography-mass spectrometry,
J. Chromatogr., 1990, 530, 307-326, https://doi.org/10.1016/S0378-4347(00)82334-8
. [all data]