Arsenic (II) sulfide

Phase change data

Data compiled by: William E. Acree, Jr., James S. Chickos

Enthalpy of vaporization

ΔvapH (kJ/mol) Temperature (K) Reference Comment
69.6750.Kuadzhe, Ustyugov, et al., 1968Based on data from 663. - 838. K.

References

Kuadzhe, Ustyugov, et al., 1968
Kuadzhe, B.M.; Ustyugov, G.P.; Kudryavtsev, A.A., Tr. Mosk. Khim. Tekhnol. Inst., 1968, 58, 27. [all data]