α-Methoxybenzyl cyanide

Condensed phase thermochemistry data

Data compiled by: Eugene S. Domalski and Elizabeth D. Hearing

Constant pressure heat capacity of solid

Cp,solid (J/mol*K) Temperature (K) Reference
153.9298.15Zamkanei, Kaiser, et al., 1983

References

Zamkanei, Kaiser, et al., 1983
Zamkanei, M.; Kaiser, J.H.; Birkhofer, H.; Beckhaus, H.d.; Ruechardt, C., Substituent effects on carbon-carbon bond strength. 5. Kietics and thermochemistry of the homolytic dissociation of meso- and D,L-2,3-dimethoxy-2,3-diphenylsuccinonitrile, Chem. Ber., 1983, 116, 3216-3234. [all data]