1,1'-[ethylidenebis(oxy)]bispentane
- Formula: C12H26O2
- Molecular weight: 202.3336
- IUPAC Standard InChIKey: MIAGHUUTGZIIJW-UHFFFAOYSA-N
- CAS Registry Number: 13002-08-9
- Chemical structure:
View 3d structure (requires JavaScript / HTML 5) - Other names: 1,1-dipentoxyethane

Phase change data

Data compiled by: Thermodynamics Research Center, NIST Boulder Laboratories, Chris Muzny director
Quantity | Value | Units | Method | Reference | Comment |
---|---|---|---|---|---|
Tboil | 372.45 | K | N/A | Timmermans, 1927 | Uncertainty assigned by TRC = 0.6 K; source of data not clear |

References

Timmermans, 1927
Timmermans, J.,
The Melting Point of Organic Substances,
Bull. Soc. Chim. Belg., 1927, 36, 502. [all data]