tris(η5-cyclopenta-2,4-dien-1-yl)scandium
- Formula: C15H15Sc
- Molecular weight: 240.2355
- CAS Registry Number: 1298-54-0

Condensed phase thermochemistry data

Data compiled by: José A. Martinho Simões
Quantity | Value | Units | Method | Reference | Comment |
---|---|---|---|---|---|
ΔfH°solid | -3.2 ± 1.1 | kcal/mol | Review | Martinho Simões | |
Quantity | Value | Units | Method | Reference | Comment |
ΔcH°solid | -2148.0 ± 1.0 | kcal/mol | CC-SB | Devyatykh, Rabinovich, et al., 1974 | Please also see Pedley and Rylance, 1977 and Tel'noi and Rabinovich, 1977. |

Phase change data

Data compiled as indicated in comments:
AC - William E. Acree, Jr., James S. Chickos
MS - José A. Martinho Simões
Quantity | Value | Units | Method | Reference | Comment |
---|---|---|---|---|---|
ΔsubH° | 23.2 ± 0.84 | kcal/mol | N/A | Pilcher and Skinner, 1983 | See also Devyatykh, Rabinovitch, et al., 1974.; AC |
ΔsubH° | 21.9 ± 0.84 | kcal/mol | CC-SB | Cox and Pilcher, 1970 | MS |

Gas phase thermochemistry data

Data compiled by: José A. Martinho Simões

Quantity Value Units Method Reference Comment
Δfgas83.6 ± 5.9kJ/molReviewMartinho Simões

References

Martinho Simões
Martinho Simões, J.A.,
Private communication (see http://webbook.nist.gov/chemistry/om/). [all data]
Devyatykh, Rabinovich, et al., 1974
Devyatykh, C.G.; Rabinovich, I.B.; Tel'noi, V.I.; Borisov, G.K.; Zyazina, L.F.,
Dokl. Akad. Nauk SSSR, 1974, 217, 609. [all data]
Pedley and Rylance, 1977
Pedley, J.B.; Rylance, J.,
Computer Analysed Thermochemical Data: Organic and Organometallic Compounds, University of Sussex, Brigton, 1977. [all data]
Tel'noi and Rabinovich, 1977
Tel'noi, V.I.; Rabinovich, I.B.,
Russ. Chem. Rev., 1977, 46, 689. [all data]
Pilcher and Skinner, 1983
Pilcher, G.; Skinner, H.A.,
Thermochemistry of organometallic compounds, 1983, 43-90, https://doi.org/10.1002/9780470771686.ch2
. [all data]
Devyatykh, Rabinovitch, et al., 1974
Devyatykh, C.G.; Rabinovitch, I.B.; Tel'noi, V.I.; Borisov, G.K.; Zyazina, L.F.,
Dokl. Akad. Nauk SSSR, 1974, 217, 673. [all data]
Cox and Pilcher, 1970
Cox, J.D.; Pilcher, G.,
Thermochemistry of Organic and Organometallic Compounds
in Academic Press, New York, 1970. [all data]