Nickel, bis[(1,2,5,6-η)-1,5-cyclooctadiene]-
- Formula: C16H24Ni
- Molecular weight: 275.0552
- IUPAC Standard InChIKey: JRTIUDXYIUKIIE-UHFFFAOYSA-N
- CAS Registry Number: 1295-35-8
- Chemical structure:
View 3d structure (requires JavaScript / HTML 5) - Other names: Nickel, bis(1,5-cyclooctadiene)-; Bis(cyclooctadiene)nickel; Bis(1,5-cyclooctadiene)nickel; Bis(1,5-cyclooctadiene)nickel(0); Bis-1,5-cyclooctadienylnickel; Di(1,5-cyclooctadiene)nickel; Dicyclooctadiene nickel; Nickel dicyclooctadiene

Reaction thermochemistry data

Data compiled by: José A. Martinho Simões
Individual Reactions
(solution) = 2
(solution) +
(cr)
By formula: (Ni(C8H12)2) (solution) = 2C8H12 (solution) + Ni (cr)
Quantity | Value | Units | Method | Reference | Comment |
---|---|---|---|---|---|
ΔrH° | -12.6 ± 4.2 | kJ/mol | RSC | Tolman, Reutter D.W., et al., 1976 | solvent: Toluene; The toluene solution contained catalytic amounts of carbon tetrachloride. |

References

Tolman, Reutter D.W., et al., 1976
Tolman, C.A.; Reutter D.W.; Seidel, W.C.,
J. Organometal. Chem., 1976, 117, C30. [all data]