9,10-Anthracenedione, 1,4-diamino-
- Formula: C14H10N2O2
- Molecular weight: 238.2414
- IUPAC Standard InChIKey: FBMQNRKSAWNXBT-UHFFFAOYSA-N
- CAS Registry Number: 128-95-0
- Chemical structure:
View 3d structure (requires JavaScript / HTML 5) - Other names: Acetate Red Violet R; Acetoquinone Light Heliotrope NL; Acetylon Fast Red Violet R; Amacel Heliotrope R; Amaplast Red Violet P 2R; Anthraquinone, 1,4-diamino-; Artisil Direct Violet 2RP; Artisil Violet 2RP; Celanthrene Red Violet R; Celliton Fast Red Violet; Celliton Fast Red Violet RN; Celliton Fast Red Violet RNA-CF; Celliton Fast Violet R; Celliton Red Violet RN; Celutate Red Violet RH; Cibacete Violet 2R; Cibacet Violet E 2R; Cibacet Violet 2R; Cilla Fast Red Violet RN; C.I. 61100; C.I. Disperse Violet 1; C.I. Solvent Violet 11; Diacelliton Fast Violet 5R; 1,4-Diaminoanthraquinone; 1,4-Diamino-9,10-anthraquinone; Disperse Violet K; Duranol Violet 2R; Fenacet Fast Violet 5R; Gracet Violet 2R; Grasol Violet R; Interchem Acetate Red Violet RRLF; Interchem Acetate Violet R; Interchem Hisperse Violet 2RH; Krisolamine; Microsetile Violet 3R; Miketon Fast Red Violet R; Nacelan Violet 4R; NSC 7833; C.I. Disperse Violet 9; Dispersive Violet K; Duranol Violet 2R, 1,4-diamino-; Lurafix Red Violet RN; Mideton Fast Red Violet R; Nyloquinone Violet R; Oil Violet R; Oracet Violet 2R; Perliton Violet 3R; Resiren Violet TR; Seacyl Violet R; Sectacyl Violet propyl; Serisol Brilliant Violet 2R; Setacyl Violet P-R; Setacyl Violet R; Setile Violet 3R; Solvent Violet 11; Supracet Brilliant Violet 3R; 1,4-Anthraquinonyldiamine; 1,4-Diaminoanthrachinon; Celliton Fast Red Violet R; Transetile violet P 3R; Sudan Violet; Disperse Violet 1

Phase change data

Data compiled as indicated in comments:
TRC - Thermodynamics Research Center, NIST Boulder Laboratories, Chris Muzny director
AC - William E. Acree, Jr., James S. Chickos
Quantity | Value | Units | Method | Reference | Comment |
---|---|---|---|---|---|
Tfus | 484. | K | N/A | Baughman and Perenich, 1988 | Uncertainty assigned by TRC = 1. K; TRC |
Enthalpy of sublimation
ΔsubH (kJ/mol) | Temperature (K) | Method | Reference | Comment |
---|---|---|---|---|
123. | 513. | GS | NISHIDA, ISHIHARA, et al., 2008 | Based on data from 473. to 553. K. See also Nishida, Ishihara, et al., 1978.; AC |
151.2 | 461. | N/A | Stephenson and Malanowski, 1987 | Based on data from 448. to 474. K. See also Rodionova, Krutovskaya, et al., 1980.; AC |
102.6 ± 9.7 | 390. | N/A | Krien, 1984 | Based on data from 378. to 403. K.; AC |
Enthalpy of fusion
ΔfusH (kJ/mol) | Temperature (K) | Reference | Comment |
---|---|---|---|
24.2 | 484.2 | Baughman and Perenich, 1988, 2 | AC |

References

Baughman and Perenich, 1988
Baughman, G.L.; Perenich, T.A.,
Fate of dyes in aquatic systems: I. Solubility and partitioning of some hydrophobic dyes and related compounds,
Environ. Tox. Chem., 1988, 7, 3, 183, https://doi.org/10.1002/etc.5620070302
. [all data]
NISHIDA, ISHIHARA, et al., 2008
NISHIDA, K.; ISHIHARA, E.; OSAKA, T.; KOUKITU, M.,
Vapour Pressures and Heats of Sublimation of Some Disperse Dyes,
J Food Science, 2008, 93, 2, 52-54, https://doi.org/10.1111/j.1478-4408.1977.tb03324.x
. [all data]
Nishida, Ishihara, et al., 1978
Nishida, K.; Ishihara, E.; Osaka, T.; Koukitu, M.,
Vapor pressures and heats of sublimation of some disperse dyes,
Galaxia, 1978, 72, 13. [all data]
Stephenson and Malanowski, 1987
Stephenson, Richard M.; Malanowski, Stanislaw,
Handbook of the Thermodynamics of Organic Compounds, 1987, https://doi.org/10.1007/978-94-009-3173-2
. [all data]
Rodionova, Krutovskaya, et al., 1980
Rodionova, G.N.; Krutovskaya, I.V.; Rodionov, A.N.; Tuchin, Y.G.; Karpov, V.V.,
Zh. Prikl. Spektrosk., 1980, 32, 623. [all data]
Krien, 1984
Krien, G.,
Thermoanalytische untersuchungen an rauchfarbstoffen,
Thermochimica Acta, 1984, 81, 29-43, https://doi.org/10.1016/0040-6031(84)85108-4
. [all data]
Baughman and Perenich, 1988, 2
Baughman, George L.; Perenich, Theresa A.,
Fate of dyes in aquatic systems: I. Solubility and partitioning of some hydrophobic dyes and related compounds,
Environ Toxicol Chem, 1988, 7, 3, 183-199, https://doi.org/10.1002/etc.5620070302
. [all data]