1H-Pyrrole-2,5-dione, 1-ethyl-
- Formula: C6H7NO2
- Molecular weight: 125.1253
- IUPAC Standard InChIKey: HDFGOPSGAURCEO-UHFFFAOYSA-N
- CAS Registry Number: 128-53-0
- Chemical structure:
View 3d structure (requires JavaScript / HTML 5) - Other names: Maleimide, N-ethyl-; Ethylmaleimide; Maleic acid N-ethylimide; N-Ethylmaleimide; NEM; USAF B-121

Gas phase ion energetics data

Data compiled by: John E. Bartmess
Electron affinity determinations
EA (eV) | Method | Reference | Comment |
---|---|---|---|
1.123 ± 0.087 | IMRE | Paul and Kebarle, 1989 | ΔGea(423 K) = -25.5±1 kcal/mol, ΔS(est) = -1±3 eu |

References

Paul and Kebarle, 1989
Paul, G.; Kebarle, P.,
Electron Affinities of Cyclic Unsaturated Dicarbonyls: Maleic Anhydrides, Maleimides, and Cyclopentendione,
J. Am. Chem. Soc., 1989, 111, 2, 464, https://doi.org/10.1021/ja00184a009
. [all data]