Nopyl acetate
- Formula: C13H20O2
- Molecular weight: 208.2967
- IUPAC Standard InChIKey: AWNOGHRWORTNEI-UHFFFAOYSA-N
- CAS Registry Number: 128-51-8
- Chemical structure:
View 3d structure (requires JavaScript / HTML 5) - Other names: Bicyclo[3.1.1]hept-2-ene-2-ethanol, 6,6-dimethyl-, acetate; Citroviol; Lignyl acetate; Nopol acetate; 2-Norpinene-2-ethanol, 6,6-dimethyl-, acetate; 2-Pinene-10-methyl acetate; 6,6-Dimethyl-2-norpinene-2-ethanol, acetate; 6,6-Dimethylbicyclo(3.1.1)-2-heptene-2-ethyl acetate

Kovats' RI, non-polar column, isothermal

Column type | Active phase | Temperature (C) | I | Reference | Comment |
---|---|---|---|---|---|
Capillary | SE-30 | 150. | 1413. | Tudor and Moldovan, 1999 | |
Capillary | SE-30 | 100. | 1413.1 | Tudor, 1997 | 40. m/0.35 mm/0.35 μm |

Normal alkane RI, non-polar column, custom temperature program

Column type | Active phase | I | Reference | Comment |
---|---|---|---|---|
Capillary | CB-1 | 1400. | Kannaste, Vongvanich, et al., 2008 | 30. m/0.25 mm/0.25 μm, Helium; Program: 40 0C (2 min) 4 0C/min -> 180 0C 20 0C/min -> 220 0C (1 min) |
Capillary | SE-30 | 1412. | Vinogradov, 2004 | Program: not specified |

Normal alkane RI, polar column, custom temperature program

Column type | Active phase | I | Reference | Comment |
---|---|---|---|---|
Capillary | Carbowax 20M | 1777. | Vinogradov, 2004 | Program: not specified |

References

Tudor and Moldovan, 1999
Tudor, E.; Moldovan, D.,
Temperature Dependence of the Retention Index for Perfumery Compounds on a Se-30 Glass Capillary Column. II. The Hyperbolic Equation,
J. Chromatogr., 1999, 848, 1-2, 215-227, https://doi.org/10.1016/S0021-9673(99)00412-4
. [all data]
Tudor, 1997
Tudor, E.,
Temperature dependence of the retention index for perfumery compounds on a SE-30 glass capillary column. I. Linear equations,
J. Chromatogr. A, 1997, 779, 1-2, 287-297, https://doi.org/10.1016/S0021-9673(97)00453-6
. [all data]
Kannaste, Vongvanich, et al., 2008
Kannaste, A.; Vongvanich, N.; Borg-Karlson, A.-K.,
Infestation by a Nalepella species induces emissions of alpha- and beta-farnesenes, (-)-linalool and aromatic compounds in Norway spruce clones of different susceptibility to the large pine weevil,
Anthropod-Plant Interactions, 2008, 2, 1, 31-41, https://doi.org/10.1007/s11829-008-9029-4
. [all data]
Vinogradov, 2004
Vinogradov, B.A.,
Production, composition, properties and application of essential oils, 2004, retrieved from http://viness.narod.ru. [all data]