Pregnane-3,20-dione, (5β)-

Kovats' RI, non-polar column, isothermal

View large format table.

Column type Active phase Temperature (C) I Reference Comment
PackedSE-30225.2630.Knights, 1966Gas Chrom P AW DMCS; Column length: 1. m

References

Knights, 1966
Knights, B.A., Application of retention indices to steroid gas chromatography, J. Gas Chromatogr., 1966, 4, 9, 329-331, https://doi.org/10.1093/chromsci/4.9.329 . [all data]