Sulfisoxazole
- Formula: C11H13N3O3S
- Molecular weight: 267.304
- IUPAC Standard InChIKey: NHUHCSRWZMLRLA-UHFFFAOYSA-N
- CAS Registry Number: 127-69-5
- Chemical structure:
View 3d structure (requires JavaScript / HTML 5) - Other names: Benzenesulfonamide, 4-amino-N-(3,4-dimethyl-5-isoxazolyl)-; Sulfanilamide, N.sup1.-(3,4-dimethyl-5-isoxazolyl)-; Alphazole; Amidoxal; Chemouag; Dorsulfan Warthausen; Entusul; Gantrisin; Gantrisona; Gantrosan; Isoxamin; N(Sup1)-(3,4-Dimethyl-5-isoxazolyl)sulfanilamide; Neazolin; Neoxazol; Norilgan-S; Pancid; Roxosul tablets; Soxisol; Stansin; Sulbio; Sulfadimethylisoxazole; Sulfafurazol; Sulfafurazole; Sulfagan; Sulfaisoxazole; Sulfasol; Sulfazin; Sulfisoxasole; Sulfisoxazol; Sulfisoxazole dialamine; Sulfofurazole; Sulphafurazole; Thiasin; Unisulf; Uritrisin; 3,4-Dimethyl-5-sulfanilamidoisoxazole; 3,4-Dimethyl-5-sulfonamidoisoxazole; 5-(p-Aminobenzenesulfonamido)-3,4-dimethylisoxazole; 5-(p-Aminobenzenesulphonamido)-3,4-dimethylisoxazole; 5-(4-Aminophenylsulfonamido)-3,4-dimethylisoxazole; 5-Sulfanilamido-3,4-dimethylisoxazole; V-Sul; Accuzole; Cosoxazole; Entusil; G-sox; NCI-C50022; Renosulfan; Sosol; Soxo; Soxomide; Sulfalar; Sulfanilamide, N(sup1)-(3,4-dimethyl-5-isoxazolyl)-; Sulfasoxazole; Sulfisonazole; Sulfizin; Sulfoxol; Sulsoxin; SK-Soxazole; 3,4-Dimethylisoxazole-5-sulfanilamide; 5-(p-Aminobenzenesulfonamido)-3,4-dimethylisooxale; 5-(p-Aminobenzenesulphonamide)-3,4-dimethylisoxazole; 4-Amino-N-(3,4-dimethyl-5-isoxazolyl)benzenesulphonamide; 5-(4-Aminophenylsulphonamido)-3,4-dimethylisoxazole; Astrazolo; Azo gantrisin; Azosulfizin; Bactesulf; Barazae; 3,4-Dimethylisoxazole-5-sulphanilamide; N'-(3,4)Dimethylisoxazol-5-yl-sulphanilamide; N1-(3,4-Dimethyl-5-isoxazolyl)sulphanilamide; 3,4-Dimethyl-5-sulphanilamidoisoxazole; 3,4-Dimethyl-5-sulphonamidoisoxazole; Dorsulfan; Ganda; Gantrisine; J-Sul; Koro-sulf; Novazolo; Novosaxazole; NU 445; Resoxol; Roxosul; Roxoxol; Saxosozine; Sodizole; Soxamide; Soxitabs; Sulfagen; Sulfapolar; Sulfisin; Sulfizol; Sulfizole; Suloxsol; Sulphadimethylisoxazole; Sulphafuraz; Sulphafurazol; Sulphafurazolum; Sulphaisoxazole; 5-Sulphanilamido-3,4-dimethyl-isoxazole; Sulphisoxazol; Sulphofurazole; TL-Azole; Urisoxin; Urogan; U.S.-67; Vagilia; N1-(3,4-Dimethyl-5-isoxazolyl)sulfanilamide; 4-Amino-N-(3,4-dimethylisoxazol-5-yl)benzenesulfonamide; Sulphisoxazole; Gantrizin

Condensed phase thermochemistry data

Data compiled by: Hussein Y. Afeefy, Joel F. Liebman, and Stephen E. Stein
Quantity | Value | Units | Method | Reference | Comment |
---|---|---|---|---|---|
ΔfH°solid | -43.04 ± 0.91 | kcal/mol | Ccb | Ciocazanu and Meltzer, 1996 | Hfusion=8.4 kJ/mol, H2SO4.115H2O |
Quantity | Value | Units | Method | Reference | Comment |
ΔcH°solid | -1203.7 ± 0.91 | kcal/mol | Ccb | Ciocazanu and Meltzer, 1996 | Hfusion=8.4 kJ/mol, H2SO4.115H2O |

Phase change data

Data compiled as indicated in comments:
TRC - Thermodynamics Research Center, NIST Boulder Laboratories, Chris Muzny director
AC - William E. Acree, Jr., James S. Chickos
Quantity | Value | Units | Method | Reference | Comment |
---|---|---|---|---|---|
Tfus | 468.2 | K | N/A | Sunwoo and Eisen, 1971 | Uncertainty assigned by TRC = 0.5 K; TRC |
Enthalpy of fusion
ΔfusH (kcal/mol) | Temperature (K) | Method | Reference | Comment |
---|---|---|---|---|
2.01 | 448.2 | DSC | Ciocazanu and Meltzer, 1996 | AC |

References

Ciocazanu and Meltzer, 1996
Ciocazanu, I.; Meltzer, V.,
Etude thermodynamique de certains medicaments,
J. Therm. Anal., 1996, 47, 1755-1758. [all data]
Sunwoo and Eisen, 1971
Sunwoo, C.; Eisen, H.,
Solubility parameter of selected sulfonamides,
J. Pharm Sci., 1971, 60, 2, 238, https://doi.org/10.1002/jps.2600600217
. [all data]