α Isomethyl ionone
- Formula: C14H22O
- Molecular weight: 206.3239
- IUPAC Standard InChIKey: JRJBVWJSTHECJK-PKNBQFBNSA-N
- CAS Registry Number: 127-51-5
- Chemical structure:
View 3d structure (requires JavaScript / HTML 5) - Species with the same structure:
- Stereoisomers:
- Other names: 4-(2,6,6-Trimethyl 2-cyclohexen-1-yl)-3-methyl-3-buten-2-one; 3-Buten-2-one, 3-methyl-4-(2,6,6-trimethyl-2-cyclohexen-1-yl)-; α-Cetone; α-Ionone, isomethyl-; Cetone alpha; iso-α-methyl ionone; Isomethyl-α-ionone; Methyl-α-isoionone; 8-Methyl-α-ionone; NSC 66432; Isomethylionone; 3-methyl-4-(2,6,6-trimethyl-2-cyclohexenyl)-3-buten-2-one; 3-Methyl-4-(2,6,6-trimethylcyclohex-2-enyl)-but-3-en-2-one; 3-methyl-4-(2,6,6-trimethyl-2-cyclohexen-1-yl)-3-buten-2-one

Phase change data

Data compiled by: William E. Acree, Jr., James S. Chickos
Enthalpy of vaporization
ΔvapH (kJ/mol) | Temperature (K) | Method | Reference | Comment |
---|---|---|---|---|
69.5 | 303. | A | Stephenson and Malanowski, 1987 | Based on data from 288. to 333. K. |

Kovats' RI, non-polar column, isothermal

Column type | Active phase | Temperature (C) | I | Reference | Comment |
---|---|---|---|---|---|
Capillary | SE-30 | 100. | 1471.8 | Tudor, 1997 | 40. m/0.35 mm/0.35 μm |

Kovats' RI, polar column, isothermal

Column type | Active phase | Temperature (C) | I | Reference | Comment |
---|---|---|---|---|---|
Capillary | Carbowax 20M | 150. | 1877. | Tudor, Moldovan, et al., 1999 | Phase thickness: 0.45 μm |

Van Den Dool and Kratz RI, non-polar column, temperature ramp

Column type | Active phase | I | Reference | Comment |
---|---|---|---|---|
Capillary | SLB-5MS | 1480. | Mondello, Sciarrone, et al., 2007 | 10. m/0.1 mm/0.1 μm, 40. K/min; Tstart: 40. C; Tend: 250. C |
Capillary | SLB-5MS | 1480. | Mondello, Sciarrone, et al., 2007 | 10. m/0.1 mm/0.1 μm, 40. K/min; Tstart: 40. C; Tend: 250. C |
Capillary | SLB-5MS | 1481. | Mondello, Sciarrone, et al., 2007 | 10. m/0.1 mm/0.1 μm, 40. K/min; Tstart: 40. C; Tend: 250. C |
Capillary | SLB-5ms | 1473. | Mondello and Costa, 2006 | 7. K/min, 325. C @ 10. min; Tstart: 50. C |
Capillary | SLB-5ms | 1474. | Mondello and Costa, 2006 | 7. K/min, 325. C @ 10. min; Tstart: 50. C |
Capillary | 5 % Phenyl methyl siloxane | 1470. | Mondello and Costa, 2006 | 7. K/min, 325. C @ 10. min; Tstart: 50. C |
Capillary | SE-30 | 1478. | Paramonov, Khalilova, et al., 2000 | 6. K/min; Column length: 50. m; Column diameter: 0.2 mm; Tstart: 50. C; Tend: 250. C |
Capillary | CP Sil 5 CB | 1490. | Halket and Schulten, 1985 | 26. m/0.32 mm/1.25 μm, 10. K/min; Tstart: 100. C; Tend: 250. C |
Capillary | CP Sil 5 CB | 1494. | Halket and Schulten, 1985 | 26. m/0.32 mm/1.25 μm, 10. K/min; Tstart: 100. C; Tend: 250. C |

Van Den Dool and Kratz RI, non-polar column, custom temperature program

Column type | Active phase | I | Reference | Comment |
---|---|---|---|---|
Capillary | SLB-5MS | 1473. | Mondello, Sciarrone, et al., 2007 | 30. m/0.25 mm/0.25 μm; Program: not specified |

Normal alkane RI, non-polar column, temperature ramp

Column type | Active phase | I | Reference | Comment |
---|---|---|---|---|
Capillary | BPX-5 | 1484. | Bieri and Marriott, 2008 | 30. m/0.25 mm/0.25 μm, Hydrogen, 3. K/min; Tstart: 100. C; Tend: 999. C |
Capillary | BPX-5 | 1476. | Bieri and Marriott, 2008 | 30. m/0.25 mm/0.25 μm, Hydrogen, 3. K/min; Tstart: 60. C; Tend: 999. C |
Capillary | BPX-5 | 1481. | Bieri and Marriott, 2008 | 30. m/0.25 mm/0.25 μm, Hydrogen, 3. K/min; Tstart: 60. C; Tend: 999. C |
Capillary | BPX-5 | 1481. | Bieri and Marriott, 2008 | 30. m/0.25 mm/0.25 μm, Hydrogen, 3. K/min; Tstart: 60. C; Tend: 999. C |
Capillary | BPX-5 | 1482. | Bieri and Marriott, 2008 | 30. m/0.25 mm/0.25 μm, Hydrogen, 3. K/min; Tstart: 60. C; Tend: 999. C |
Capillary | BPX-5 | 1486. | Bieri and Marriott, 2008 | 30. m/0.25 mm/0.25 μm, Hydrogen, 5. K/min; Tstart: 60. C; Tend: 999. C |
Capillary | Equity-5 MS | 1473. | Mondello, Casilli, et al., 2008 | 30. m/0.25 mm/0.25 μm, Helium, 1.5 K/min; Tstart: 40. C; Tend: 260. C |
Capillary | HP-5 | 1484.5 | Leffingwell and Alford, 2005 | 60. m/0.32 mm/0.25 μm, He, 30. C @ 2. min, 2. K/min, 260. C @ 28. min |

Normal alkane RI, non-polar column, custom temperature program

Column type | Active phase | I | Reference | Comment |
---|---|---|---|---|
Capillary | HP-5 | 1508. | Zhao, Li, et al., 2008 | 30. m/0.25 mm/0.25 μm; Program: 40 0C (2 min) 5 0C/min -> 80 0C 7 oC/min -> 160 0C 9 0C/min -> 200 0C 20 0C/min -> 280 0C (10 min) |
Capillary | HP-5 | 1471. | Zhao, Li, et al., 2008 | 30. m/0.25 mm/0.25 μm; Program: not specified |
Capillary | HP-5 | 1479. | Splivallo, Bossi, et al., 2007 | He; Program: 50C => 3C/min => 200C(10min) => 10C/min => 290C(10min) |

Normal alkane RI, polar column, custom temperature program

Column type | Active phase | I | Reference | Comment |
---|---|---|---|---|
Capillary | DB-Wax | 1872. | Welke, Manfroi, et al., 2012 | 30. m/0.25 mm/0.25 μm, Helium; Program: not specified |
Capillary | DB-Wax | 1900. | Welke, Manfroi, et al., 2012 | 30. m/0.25 mm/0.25 μm, Helium; Program: not specified |
Capillary | DB-Wax Etr | 1848. | Loskos, Hernandez-Orte, et al., 2007 | 60. m/0.25 mm/0.5 μm, He; Program: 40C(3min) => 10C/min => 90C => 2C/min => 230C (37min) |

References

Stephenson and Malanowski, 1987
Stephenson, Richard M.; Malanowski, Stanislaw,
Handbook of the Thermodynamics of Organic Compounds, 1987, https://doi.org/10.1007/978-94-009-3173-2
. [all data]
Tudor, 1997
Tudor, E.,
Temperature dependence of the retention index for perfumery compounds on a SE-30 glass capillary column. I. Linear equations,
J. Chromatogr. A, 1997, 779, 1-2, 287-297, https://doi.org/10.1016/S0021-9673(97)00453-6
. [all data]
Tudor, Moldovan, et al., 1999
Tudor, E.; Moldovan, D.; Zârna, N.,
Temperature dependence of the retention index for perfumery compounds on two carbowax-20M glass capillary columns with different film thickness. 2,
Rev. Roum. Chim., 1999, 44, 7, 665-675. [all data]
Mondello, Sciarrone, et al., 2007
Mondello, L.; Sciarrone, D.; Casilli, A.; Tranchida, P.Q.; Dugo, P.; Dugo, G.,
Fast gas chromatography-full scan quadrupole mass spectrometry for the determination of allergens in fragrances,
J. Sep. Sci., 2007, 30, 12, 1905-1911, https://doi.org/10.1002/jssc.200600541
. [all data]
Mondello and Costa, 2006
Mondello, L.; Costa, R.,
A new generation of GC capillary columns: SLB-5ms,
The Reporter (Europe), 2006, 20, March, 17-19. [all data]
Paramonov, Khalilova, et al., 2000
Paramonov, E.A.; Khalilova, A.Z.; Odinokov, V.N.; Khalilov, L.M.,
Identification and biological activity of volatile organic compounds isolated from plants and insects. III. Chromatography-mass spectrometry of volatile compoundsof Aegopodium podagraria,
Chem. Nat. Compd. (Engl. Transl.), 2000, 36, 6, 584-586, https://doi.org/10.1023/A:1017563708858
. [all data]
Halket and Schulten, 1985
Halket, J.M.; Schulten, H.-R.,
Thick-film capillary column gas chromatography-field ionization mass spectrometry: A complementary technique for the rapid analysis of volatiles,
J. Chromatogr., 1985, 322, 200-205, https://doi.org/10.1016/S0021-9673(01)97672-1
. [all data]
Bieri and Marriott, 2008
Bieri, S.; Marriott, P.J.,
Dual-injection system with multiply injections for determining sidimentional retention indexes in comprehensive two-dimensional gas chromatography,
Anal. Chem., 2008, 80, 3, 760-768, https://doi.org/10.1021/ac071367q
. [all data]
Mondello, Casilli, et al., 2008
Mondello, L.; Casilli, A.; Tranchida, Q.; Sciarrone, D.; Dugo, P.; Dugo, G.,
Analysis of allergens in fragrances using multiple heart-cut multidimentional gas chromatography - mass spectrometry,
LC-GC Europe, 2008, 21, 130. [all data]
Leffingwell and Alford, 2005
Leffingwell, J.C.; Alford, E.D.,
Volatile constituents of Perique tobacco,
Electron. J. Environ. Agric. Food Chem., 2005, 4, 2, 899-915. [all data]
Zhao, Li, et al., 2008
Zhao, Y.; Li, J.; Xu, Y.; Duan, H.; Fan, W.; Zhao, G.,
EXtraction, preparation and identification of volatile compounds in Changyu XO brandy,
Chinese J. Chromatogr., 2008, 26, 2, 212-222, https://doi.org/10.1016/S1872-2059(08)60014-0
. [all data]
Splivallo, Bossi, et al., 2007
Splivallo, R.; Bossi, S.; Maffei, M.; Bonfante, P.,
Discrimination of truffle fruiting body versus mycelial aromas by stir bar sorptive extraction,
Phytochemistry, 2007, 68, 20, 2584-2598, https://doi.org/10.1016/j.phytochem.2007.03.030
. [all data]
Welke, Manfroi, et al., 2012
Welke, J.E.; Manfroi, V.; Zanus, M.; Lazarotto, M.; Zini, C.A.,
Characterization of the volatile profile of Brazilian merlot wines through comprehensive two dimensional gas chromatography time-of-flight mass spectrometric detection,
J. Chromatogr. A, 2012, 1226, 124-139, https://doi.org/10.1016/j.chroma.2012.01.002
. [all data]
Loskos, Hernandez-Orte, et al., 2007
Loskos, N.; Hernandez-Orte, P.; Cacho, J.; Ferreira, V.,
Release and formation of varietal aroma compounds during alcoholic fermentation from nonfloral grape odorless flavor precursors fractions,
J. Agric. Food Chem., 2007, 55, 16, 6674-6684, https://doi.org/10.1021/jf0702343
. [all data]