Trimethadione
- Formula: C6H9NO3
- Molecular weight: 143.1406
- IUPAC Standard InChIKey: IRYJRGCIQBGHIV-UHFFFAOYSA-N
- CAS Registry Number: 127-48-0
- Chemical structure:
View 3d structure (requires JavaScript / HTML 5) - Other names: 2,4-Oxazolidinedione, 3,5,5-trimethyl-; Absentol; Edion; Epidione; Epixal; Mino aleviatin; Petidion; Petidon; Petilep; Pitmal; Ptimal; Tridion; Tridione; Tridone; Trimedal; Trimetadione; Trimethadion; Trimethin; Trimetin; Trioxanona; Troxidone; 3,3,5-Trimethyl-2,4-diketooxazolidine; 3,5,5-Trimethyl-2,4-oxazolidinedione; 3,5,5-Trimethyloxazolidine-2,4-dione; A 2297; Absetil; Convenixa; Convexina; Epidone; Etydion; Minoaleuiatin; Petimalin; Tioxanona; Tredione; Tricione; Tridilona; Trilidona; Trimedone; Trimethdione; Triozanona; Tromedone; 3,5,5-Trojmetylooksazolidyno-2,4-dion; NSC 15799; Neo-absentol; 3,5,5-Trimethyl-2,4-oxazolidinedionenol; 3,5,5-Trimethyl-1,3-oxazolidine-2,4-dione

Kovats' RI, non-polar column, temperature ramp

Column type | Active phase | I | Reference | Comment |
---|---|---|---|---|
Packed | OV-101 | 1080. | Maurer, 1990 | N2, Chromosorb G HP, 100. C @ 3. min, 30. K/min, 310. C @ 5. min; Column length: 0.6 m |

Van Den Dool and Kratz RI, non-polar column, custom temperature program

Column type | Active phase | I | Reference | Comment |
---|---|---|---|---|
Capillary | VF-5MS | 1032.7 | Tret'yakov, 2008 | 30. m/0.25 mm/0.25 μm, He; Program: Multi-step temperature program; T(initial)=60C; T(final)=270C |

Normal alkane RI, non-polar column, custom temperature program

Column type | Active phase | I | Reference | Comment |
---|---|---|---|---|
Other | Methyl Silicone | 1100. | Ardrey and Moffat, 1981 | Program: not specified |

References

Maurer, 1990
Maurer, H.H.,
Detection of anticonvulsants and their metabolites in urine within a general unknown analysis procedure using computerized gas chromatography-mass spectrometry,
Arch. Toxicol., 1990, 64, 7, 554-561, https://doi.org/10.1007/BF01971834
. [all data]
Tret'yakov, 2008
Tret'yakov, K.V.,
Retention Data. NIST Mass Spectrometry Data Center., NIST Mass Spectrometry Data Center, 2008. [all data]
Ardrey and Moffat, 1981
Ardrey, R.E.; Moffat, A.C.,
Gas-liquid chromatographic retention indices of 1318 substances of toxicological interest on SE-30 or OV-1 stationary phase,
J. Chromatogr., 1981, 220, 3, 195-252, https://doi.org/10.1016/S0021-9673(00)81925-1
. [all data]