tris(η5-2,4-cyclopentadien-1-yl)neodymium
- Formula: C15H15Nd
- Molecular weight: 339.522
- CAS Registry Number: 1273-98-9

Phase change data

Data compiled by: William E. Acree, Jr., James S. Chickos
Enthalpy of sublimation
ΔsubH (kJ/mol) | Temperature (K) | Method | Reference | Comment |
---|---|---|---|---|
108.8 ± 3.8 | 533. to 633. | N/A | Borisov, Krasnova, et al., 1973 | |
134.7 ± 2.1 | 338. to 438. | ME | Haug, 1971 | See also Haug, 1971, 2. |

References

Borisov, Krasnova, et al., 1973
Borisov, G.K.; Krasnova, S.G.; Devyatykh, G.G.,
Russ. J. Phys. Chem., 1973, 18, 346. [all data]
Haug, 1971
Haug, H.O.,
Ges. Kernforsch m.b.H. [Rep.] KFK-1283, 1971, 23. [all data]
Haug, 1971, 2
Haug, H.O.,
Dampfdruckmessungen von cyclopentadienylkomplexen des urans und einiger lanthaniden nach der effusionsmethode,
Journal of Organometallic Chemistry, 1971, 30, 1, 53-57, https://doi.org/10.1016/S0022-328X(00)82595-4
. [all data]