4-Hydroxy-2-methoxycinnamaldehyde
- Formula: C10H10O3
- Molecular weight: 178.1846
- IUPAC Standard InChIKey: MRCGVXARHKOYKU-NSCUHMNNSA-N
- CAS Registry Number: 127321-19-1
- Chemical structure:
View 3d structure (requires JavaScript / HTML 5) - Other names: (2 E)-3-(4-hydroxy-2-methoxyphenyl)-2-propenal

Van Den Dool and Kratz RI, polar column, custom temperature program

Column type | Active phase | I | Reference | Comment |
---|---|---|---|---|
Capillary | Stabilwax | 2681. | Natali N., Chinnici F., et al., 2006 | 30. m/0.25 mm/0.25 μm, He; Program: 40C => 3C/min => 100C => 5C/min => 240C(10min) |

Normal alkane RI, non-polar column, custom temperature program

Column type | Active phase | I | Reference | Comment |
---|---|---|---|---|
Capillary | HP-5 | 1740. | Zhao, Li, et al., 2008 | 30. m/0.25 mm/0.25 μm; Program: 40 0C (2 min) 5 0C/min -> 80 0C 7 oC/min -> 160 0C 9 0C/min -> 200 0C 20 0C/min -> 280 0C (10 min) |

References

Natali N., Chinnici F., et al., 2006
Natali N.; Chinnici F.; Riponi C.,
Characterization of volatiles in extracts from oak chips obtained by accelerated solvent extraction (ASE),
J. Agric. Food Chem., 2006, 54, 21, 8190-8198, https://doi.org/10.1021/jf0614387
. [all data]
Zhao, Li, et al., 2008
Zhao, Y.; Li, J.; Xu, Y.; Duan, H.; Fan, W.; Zhao, G.,
EXtraction, preparation and identification of volatile compounds in Changyu XO brandy,
Chinese J. Chromatogr., 2008, 26, 2, 212-222, https://doi.org/10.1016/S1872-2059(08)60014-0
. [all data]