bis(cyclopentadienyl)titanium
- Formula: C10H10Ti
- Molecular weight: 178.053
- CAS Registry Number: 1271-29-0

Phase change data

Data compiled as indicated in comments:
AC - William E. Acree, Jr., James S. Chickos
MS - José A. Martinho Simões
Quantity | Value | Units | Method | Reference | Comment |
---|---|---|---|---|---|
ΔsubH° | 58.5 ± 8.0 | kJ/mol | N/A | Pilcher and Skinner, 1983 | See also Tel'noi, Rabinovich, et al., 1971.; AC |
ΔsubH° | 58.5 ± 8.0 | kJ/mol | CC-SB | Tel' noi, Rabinovich, et al., 1971 | MS |

Gas phase thermochemistry data

Data compiled by: José A. Martinho Simões
Quantity | Value | Units | Method | Reference | Comment |
---|---|---|---|---|---|
ΔfH°gas | -2.7 ± 2.8 | kcal/mol | Review | Martinho Simões |

Condensed phase thermochemistry data

Data compiled by: José A. Martinho Simões
Quantity | Value | Units | Method | Reference | Comment |
---|---|---|---|---|---|
ΔfH°solid | -16.7 ± 2.0 | kcal/mol | Review | Martinho Simões | |
Quantity | Value | Units | Method | Reference | Comment |
ΔcH°solid | -1491.0 ± 2.0 | kcal/mol | CC-SB | Tel' noi, Rabinovich, et al., 1971 | Please also see Pedley and Rylance, 1977. |

References

Pilcher and Skinner, 1983
Pilcher, G.; Skinner, H.A.,
Thermochemistry of organometallic compounds, 1983, 43-90, https://doi.org/10.1002/9780470771686.ch2
. [all data]
Tel'noi, Rabinovich, et al., 1971
Tel'noi, V.I.; Rabinovich, I.B.; Latyaeva, V.N.; Lineva, A.N.,
Dokl. Akad. Nauk SSSR, 1971, 197, 6, 1348. [all data]
Tel' noi, Rabinovich, et al., 1971
Tel' noi, V.I.; Rabinovich, I.B.; Latyaeva, V.N.; Lineva, A.N.,
Dokl. Akad. Nauk SSSR, 1971, 197, 353. [all data]