Mangese,bis-Cyclopentadienyl
- Formula: C10H10Mn
- Molecular weight: 185.1244
- IUPAC Standard InChIKey: QROCSKKOEBOLQO-UHFFFAOYSA-N
- CAS Registry Number: 1271-27-8
- Chemical structure:
View 3d structure (requires JavaScript / HTML 5) - Species with the same structure:
- Other names: dicyclopenta-2,4-dien-1-ylmanganese; bis(cyclopentadienyl)manganese

Phase change data

Data compiled by: William E. Acree, Jr., James S. Chickos
Quantity | Value | Units | Method | Reference | Comment |
---|---|---|---|---|---|
ΔsubH° | 75.7 ± 1.7 | kJ/mol | N/A | Pilcher and Skinner, 1983 | See also Tel'noi, Rabinovich, et al., 1971. |
Enthalpy of vaporization
ΔvapH (kJ/mol) | Temperature (K) | Method | Reference | Comment |
---|---|---|---|---|
58.0 | 393. | A | Stephenson and Malanowski, 1987 | Based on data from 378. to 435. K. |
Enthalpy of sublimation
ΔsubH (kJ/mol) | Temperature (K) | Method | Reference | Comment |
---|---|---|---|---|
72.4 | 371.5 | A | Stephenson and Malanowski, 1987 | Based on data from 298. to 445. K. |

References

Pilcher and Skinner, 1983
Pilcher, G.; Skinner, H.A.,
Thermochemistry of organometallic compounds, 1983, 43-90, https://doi.org/10.1002/9780470771686.ch2
. [all data]
Tel'noi, Rabinovich, et al., 1971
Tel'noi, V.I.; Rabinovich, I.B.; Latyaeva, V.N.; Lineva, A.N.,
Dokl. Akad. Nauk SSSR, 1971, 197, 6, 1348. [all data]
Stephenson and Malanowski, 1987
Stephenson, Richard M.; Malanowski, Stanislaw,
Handbook of the Thermodynamics of Organic Compounds, 1987, https://doi.org/10.1007/978-94-009-3173-2
. [all data]