bis(η5-Cyclopentadienyl) chromium
- Formula: C10H10Cr
- Molecular weight: 182.1825
- IUPAC Standard InChIKey: OXPNGPODCRFNTM-UHFFFAOYSA-N
- CAS Registry Number: 1271-24-5
- Chemical structure:

Gas phase thermochemistry data

Data compiled by: José A. Martinho Simões
Quantity | Value | Units | Method | Reference | Comment |
---|---|---|---|---|---|
ΔfH°gas | 249.3 ± 2.9 | kJ/mol | Review | Martinho Simões | |
ΔfH°gas | 257.0 ± 3.3 | kJ/mol | Review | Martinho Simões |

Condensed phase thermochemistry data

Data compiled as indicated in comments:
MS - José A. Martinho Simões
DH - Eugene S. Domalski and Elizabeth D. Hearing
Quantity | Value | Units | Method | Reference | Comment |
---|---|---|---|---|---|
ΔfH°solid | 178.3 ± 2.6 | kJ/mol | Review | Martinho Simões | MS |
ΔfH°solid | 186. ± 3. | kJ/mol | CC-SB | Chipperfield, Sneyd, et al., 1979 | Value corrected based on a set of ancillary data by J.A. Martinho Simões; The enthalpy of combustion is not reported in Chipperfield, Sneyd, et al., 1979; MS |
Quantity | Value | Units | Method | Reference | Comment |
ΔcH°solid | -6112.8 ± 2.1 | kJ/mol | CC-SB | Tel'noi, Kirynov, et al., 1975 | Please also see Pedley and Rylance, 1977 and Tel'noi and Rabinovich, 1977.; MS |
Quantity | Value | Units | Method | Reference | Comment |
S°solid,1 bar | 236.0 | J/mol*K | N/A | Rabinovich, Nistratov, et al., 1978 | DH |
S°solid,1 bar | 236.0 | J/mol*K | N/A | Rabinovich, Nistratov, et al., 1975 | DH |
Constant pressure heat capacity of solid
Cp,solid (J/mol*K) | Temperature (K) | Reference | Comment |
---|---|---|---|
198.5 | 298. | Chhor, Pommier, et al., 1984 | T = 10 to 300 K. Unsmoothed experimental datum.; DH |
199.2 | 298.15 | Rabinovich, Nistratov, et al., 1978 | T = 5 to 300 K.; DH |
199.1 | 298.15 | Rabinovich, Nistratov, et al., 1975 | T = 5 to 298.15 K.; DH |

Phase change data

Data compiled as indicated in comments:
TRC - Thermodynamics Research Center, NIST Boulder Laboratories, Chris Muzny director
AC - William E. Acree, Jr., James S. Chickos
MS - José A. Martinho Simões
DH - Eugene S. Domalski and Elizabeth D. Hearing
Quantity | Value | Units | Method | Reference | Comment |
---|---|---|---|---|---|
Tfus | 452.1 | K | N/A | Baev, Barkatin, et al., 1979 | Crystal phase 1 phase; Uncertainty assigned by TRC = 0.5 K; TRC |
Quantity | Value | Units | Method | Reference | Comment |
ΔsubH° | 71.0 ± 1.3 | kJ/mol | CC-SB | Baev, Barkatin, et al., 1984 | Other values for the enthalpy of sublimation have been reported: 62.8 ± 4.2 kJ/mol Pilcher and Skinner, 1982 and 69.9 ± 1.7 kJ/mol Tel'noi and Rabinovich, 1977; MS |
ΔsubH° | 71.0 | kJ/mol | N/A | Baev, Barkatin, et al., 1984, 2 | AC |
ΔsubH° | 62.8 ± 4.2 | kJ/mol | N/A | Pilcher and Skinner, 1983 | See also Tel'noi, Kirynov, et al., 1975.; AC |
Enthalpy of vaporization
ΔvapH (kJ/mol) | Temperature (K) | Reference | Comment |
---|---|---|---|
49.5 ± 1.5 | 485. | Baev, Barkatin, et al., 1984, 2 | Based on data from 452. to 519. K.; AC |
Temperature of phase transition
Ttrs (K) | Initial Phase | Final Phase | Reference | Comment |
---|---|---|---|---|
160. to 230. | crystaline, II | crystaline, I | Pommier and Azokpota, 1976 | S = 1.5 J/mol*K Lambda type transition.; DH |
Enthalpy of phase transition
ΔHtrs (kJ/mol) | Temperature (K) | Initial Phase | Final Phase | Reference | Comment |
---|---|---|---|---|---|
0.265 | 99.7 | crystaline, II | crystaline, I | Rabinovich, Nistratov, et al., 1978 | Lambda transition between 75 to 140 K with a maximum at 99.7 K and another flat peak at 118 K.; DH |
0.265 | 99.5 | crystaline, II | crystaline, I | Rabinovich, Nistratov, et al., 1975 | Lambda transition between 75 to 140 K with a maximum at 99.7 K and another flat peak at 118 K.; DH |
Entropy of phase transition
ΔStrs (J/mol*K) | Temperature (K) | Initial Phase | Final Phase | Reference | Comment |
---|---|---|---|---|---|
2.55 | 99.7 | crystaline, II | crystaline, I | Rabinovich, Nistratov, et al., 1978 | Lambda; DH |
2.57 | 99.5 | crystaline, II | crystaline, I | Rabinovich, Nistratov, et al., 1975 | Lambda; DH |

Reaction thermochemistry data

Data compiled by: José A. Martinho Simões
Individual Reactions
(solution) +
(solution) = C11H10CrO (solution)
By formula: C10H10Cr (solution) + CO (solution) = C11H10CrO (solution)
Quantity | Value | Units | Method | Reference | Comment |
---|---|---|---|---|---|
ΔrH° | -78.7 ± 2.1 | kJ/mol | EqS | Wong and Brintzinger, 1975 | solvent: Toluene; Temperature range: 280-308 K |

Gas phase ion energetics data

Data compiled as indicated in comments:
LLK - Sharon G. Lias, Rhoda D. Levin, and Sherif A. Kafafi
RDSH - Henry M. Rosenstock, Keith Draxl, Bruce W. Steiner, and John T. Herron
Ionization energy determinations
IE (eV) | Method | Reference | Comment |
---|---|---|---|
5.50 | PE | Rabalais, Werme, et al., 1972 | LLK |
6.3 ± 0.1 | EI | Muller and D'Or, 1967 | RDSH |
5.70 | PE | Cauletti, Green, et al., 1980 | Vertical value; LLK |
5.71 | PE | Evans, Green, et al., 1974 | Vertical value; LLK |
Appearance energy determinations
Ion | AE (eV) | Other Products | Method | Reference | Comment |
---|---|---|---|---|---|
C5H5Cr+ | 12.8 ± 0.1 | ? | EI | Muller and D'Or, 1967 | RDSH |
Cr+ | 14.6 ± 0.3 | ? | EI | Muller and D'Or, 1967 | RDSH |

References

Martinho Simões
Martinho Simões, J.A.,
Private communication (see http://webbook.nist.gov/chemistry/om/). [all data]
Chipperfield, Sneyd, et al., 1979
Chipperfield, J.R.; Sneyd, J.C.R.; Webster, D.E.,
J. Organometal. Chem., 1979, 178, 177. [all data]
Tel'noi, Kirynov, et al., 1975
Tel'noi, V.I.; Kirynov, K.V.; Ermolaev, V.I.; Rabinovich, I.B.,
Dokl. Akad. Nauk SSSR, 1975, 220, 1088. [all data]
Pedley and Rylance, 1977
Pedley, J.B.; Rylance, J.,
Computer Analysed Thermochemical Data: Organic and Organometallic Compounds, University of Sussex, Brigton, 1977. [all data]
Tel'noi and Rabinovich, 1977
Tel'noi, V.I.; Rabinovich, I.B.,
Russ. Chem. Rev., 1977, 46, 689. [all data]
Rabinovich, Nistratov, et al., 1978
Rabinovich, I.B.; Nistratov, V.P.; Sheiman, M.S.; Burchalova, G.V.,
Heat capacities of dicyclopentadienyl compounds of vanadium, chromium, manganese, cobalt, and nickel,
J. Chem. Thermodynam., 1978, 10, 523-536. [all data]
Rabinovich, Nistratov, et al., 1975
Rabinovich, I.B.; Nistratov, V.P.; Sheiman, M.S.; Burchalova, G.V.,
Heat capacity and transitions in solid state. Dicyclopentadienyl compounds of transition elements,Quatrieme Conference International de Thermodynamique Chimique II,
Thermophysiques (capacites thermiques) pp., 1975, 69-76, 136. [all data]
Chhor, Pommier, et al., 1984
Chhor, K.; Pommier, C.; Diot, M.,
Low-temperature thermodynamic study of the stable and metastable phases of (C4H4N)Fe(C5H5) (C4H4P)Fe(C5H5), and (C5H5)2 Cr crystals,
J. Chem. Thermodynam., 1984, 16, 503-517. [all data]
Baev, Barkatin, et al., 1979
Baev, A.K.; Barkatin, A.A.; Gubin, S.P.; Dyagileva, S.P.,
Thermodynamics of phase transitions and vapor state of some compounds of elements with incomplete d-shells
in Vses. Konf. po Kalorimetrii i Khim. Termodinamike, 8th, Ivanovo, p 386-389, 1979. [all data]
Baev, Barkatin, et al., 1984
Baev, A.K.; Barkatin, A.A.; Dargileva, L.M.,
Vesti Akad. Navuk BSSR, Ser. Khim. Navuk, 1984, 60.. [all data]
Pilcher and Skinner, 1982
Pilcher, G.; Skinner, H.A.,
In The Chemistry of the Metal-Carbon Bond Wiley: New York, Hartley, F. R.; Patai, S., ed(s)., 1982. [all data]
Baev, Barkatin, et al., 1984, 2
Baev, A.K.; Barkatin, A.A.; Dyagileva, L.M.,
Vestsi Akad. Navuk BSSR Ser. Khim. Navuk, 1984, 60. [all data]
Pilcher and Skinner, 1983
Pilcher, G.; Skinner, H.A.,
Thermochemistry of organometallic compounds, 1983, 43-90, https://doi.org/10.1002/9780470771686.ch2
. [all data]
Pommier and Azokpota, 1976
Pommier, C.; Azokpota, C.,
Study of phase transitions in metallocenes by determining specific heat curves,
J. Calorim. Anal. Therm. [C.R.], 1976, 3-6, 1-8. [all data]
Wong and Brintzinger, 1975
Wong, K.L.T.; Brintzinger, H.H.,
J. Am. Chem. Soc., 1975, 97, 5143. [all data]