Acetic acid, sodium salt
- Formula: C2H3NaO2
- Molecular weight: 82.0338
- IUPAC Standard InChIKey: VMHLLURERBWHNL-UHFFFAOYSA-M
- CAS Registry Number: 127-09-3
- Chemical structure:
View 3d structure (requires JavaScript / HTML 5) - Species with the same structure:
- Other names: Sodium acetate; Sodium ethanoate

Condensed phase thermochemistry data

Data compiled by: Eugene S. Domalski and Elizabeth D. Hearing
Quantity | Value | Units | Method | Reference | Comment |
---|---|---|---|---|---|
S°solid,1 bar | 138.10 | J/mol*K | N/A | Franzosini, Plautz, et al., 1983 | |
S°solid,1 bar | 123.09 | J/mol*K | N/A | Strelkev, 1955 |
Constant pressure heat capacity of solid
Cp,solid (J/mol*K) | Temperature (K) | Reference | Comment |
---|---|---|---|
100.83 | 298.15 | Franzosini, Plautz, et al., 1983 | T = 7 to 350 K. |
111.7 | 340. | Ferloni, Sanesi, et al., 1975 | crystaline, IV phase; T = 340 to 610 K. |
88.07 | 291.18 | Strelkev, 1955 | T = 13 to 292 K. Value is unsmoothed experimental datum. |

Phase change data

Data compiled as indicated in comments:
TRC - Thermodynamics Research Center, NIST Boulder Laboratories, Chris Muzny director
DH - Eugene S. Domalski and Elizabeth D. Hearing
Quantity | Value | Units | Method | Reference | Comment |
---|---|---|---|---|---|
Tfus | 601.3 | K | N/A | Ferloni, Sanesi, et al., 1975, 2 | Crystal phase 1 phase; Uncertainty assigned by TRC = 0.2 K; TRC |
Temperature of phase transition
Ttrs (K) | Initial Phase | Final Phase | Reference | Comment |
---|---|---|---|---|
21. | crystaline, II | crystaline, I | Franzosini, Plautz, et al., 1983 | S = 12.5 J/mol*K Questionable second-order transition.; DH |
Enthalpy of phase transition
ΔHtrs (kJ/mol) | Temperature (K) | Initial Phase | Final Phase | Reference | Comment |
---|---|---|---|---|---|
0.290 | 414. | crystaline, IV | crystaline, III | Ferloni, Sanesi, et al., 1975 | DH |
0.420 | 465. | crystaline, III | crystaline, II | Ferloni, Sanesi, et al., 1975 | DH |
0.170 | 527. | crystaline, II | crystaline, I | Ferloni, Sanesi, et al., 1975 | DH |
17.950 | 601.3 | crystaline, I | liquid | Ferloni, Sanesi, et al., 1975 | DH |
Entropy of phase transition
ΔStrs (J/mol*K) | Temperature (K) | Initial Phase | Final Phase | Reference | Comment |
---|---|---|---|---|---|
0.7 | 414. | crystaline, IV | crystaline, III | Ferloni, Sanesi, et al., 1975 | DH |
0.8 | 465. | crystaline, III | crystaline, II | Ferloni, Sanesi, et al., 1975 | DH |
0.3 | 527. | crystaline, II | crystaline, I | Ferloni, Sanesi, et al., 1975 | DH |
29.9 | 601.3 | crystaline, I | liquid | Ferloni, Sanesi, et al., 1975 | DH |

Reaction thermochemistry data

Data compiled by: Hussein Y. Afeefy, Joel F. Liebman, and Stephen E. Stein
Individual Reactions
By formula: 2HNaO + C2H3FO = C2H3NaO2 + FNa + H2O
Quantity | Value | Units | Method | Reference | Comment |
---|---|---|---|---|---|
ΔrH° | -56.15 ± 0.08 | kJ/mol | Cm | Pritchard and Skinner, 1950 | liquid phase; Corrected for CODATA value of ΔfH; HF(100) |
ΔrH° | -177. | kJ/mol | Cm | Carson and Skinner, 1949 | liquid phase |
By formula: HNaO + C2H2O = C2H3NaO2
Quantity | Value | Units | Method | Reference | Comment |
---|---|---|---|---|---|
ΔrH° | -208.2 ± 1.6 | kJ/mol | Cm | Nuttall, Laufer, et al., 1971 | gas phase |
ΔrH° | -197.3 | kJ/mol | Cm | Rice and Greenberg, 1934 | gas phase |
By formula: HNaO + C2H5NO = C2H3NaO2 + H3N
Quantity | Value | Units | Method | Reference | Comment |
---|---|---|---|---|---|
ΔrH° | -45.6 | kJ/mol | Cm | Calvet, 1933 | solid phase; Heat of hydrolysis |

References

Franzosini, Plautz, et al., 1983
Franzosini, P.; Plautz, W.A.; Westrum, E.F., Jr.,
Thermophysics of metal alkanoates. I. Heat capacities and thermodynamic properties of sodium methanoate and ethanoate,
J. Chem. Thermodynam., 1983, 15, 445-456. [all data]
Strelkev, 1955
Strelkev, I.I.,
Specific heat and entropy of sodium acetate,
Ukr. Khim. Zh. (Russ. Ed.), 1955, 21, 551-553. [all data]
Ferloni, Sanesi, et al., 1975
Ferloni, P.; Sanesi, M.; Franzosini, P.; C4 alkanoates, Phase transitions in the alkali C1-n.,
Z. Naturforsch. 30a, 1975, 1447-1454. [all data]
Ferloni, Sanesi, et al., 1975, 2
Ferloni, P.; Sanesi, M.; Franzosini, P.,
Phase transitions in the alkali C1-n.C4 alkanoates,
Z. Naturforsch., A: Phys., Phys. Chem., Kosmophys., 1975, 30, 1447-57. [all data]
Pritchard and Skinner, 1950
Pritchard, H.O.; Skinner, H.A.,
The heat of hydrolysis of acetyl fluoride,
J. Chem. Soc., 1950, 1099. [all data]
Carson and Skinner, 1949
Carson, A.S.; Skinner, H.A.,
201. Carbon-halogen bond energies in the acetyl halides,
J. Chem. Soc., 1949, 936-939. [all data]
Nuttall, Laufer, et al., 1971
Nuttall, R.L.; Laufer, A.H.; Kilday, M.V.,
The enthalpy of formation of ketene,
J. Chem. Thermodyn., 1971, 3, 167-174. [all data]
Rice and Greenberg, 1934
Rice, F.O.; Greenberg, J.,
Ketene. III. Heat of formation and heat of reaction with alcohols,
J. Am. Chem. Soc., 1934, 38, 2268-2270. [all data]
Calvet, 1933
Calvet, E.,
Mesures thermochimiques directes en chimie organique vitesses et chaleurs de saponification des amides. II.-Mesures effectuees et resultats obtenus,
J. Chim. Phys., 1933, 30, 140-146. [all data]