Acetic acid, potassium salt

Condensed phase thermochemistry data

Data compiled by: Eugene S. Domalski and Elizabeth D. Hearing

Quantity Value Units Method Reference Comment
solid,1 bar150.82J/mol*KN/ANgeyi, Malik, et al., 1990

Constant pressure heat capacity of solid

Cp,solid (J/mol*K) Temperature (K) Reference Comment
109.38298.15Ngeyi, Malik, et al., 1990T = 4 to 585 K.

References

Ngeyi, Malik, et al., 1990
Ngeyi, S.P.; Malik, I.; Westrum, E.F., Thermodyanamics of alkali alkanoates VII. Heat capacity and thermodynamic functions of potassium acetate from 4 to 585 K, J. Chem. Thermodynam., 1990, 22, 91-98. [all data]