(S)-3,7-dimethyl-1,6-octadien-3-ol
- Formula: C10H18O
- Molecular weight: 154.2493
- IUPAC Standard InChIKey: CDOSHBSSFJOMGT-UHFFFAOYSA-N
- CAS Registry Number: 126-90-9
- Chemical structure:
View 3d structure (requires JavaScript / HTML 5) - Species with the same structure:
- Stereoisomers:
- Other names: (d) linalool

Phase change data

Data compiled by: William E. Acree, Jr., James S. Chickos
Enthalpy of vaporization
ΔvapH (kJ/mol) | Temperature (K) | Method | Reference | Comment |
---|---|---|---|---|
65.4 | 297. | N/A | Espinosa Diaz, Guetachew, et al., 1999 | Based on data from 273. to 321. K. |
52.4 | 328. | A | Stephenson and Malanowski, 1987 | Based on data from 313. to 471. K. |

References

Espinosa Diaz, Guetachew, et al., 1999
Espinosa Diaz, M.A.; Guetachew, T.; Landy, P.; Jose, J.; Voilley, A.,
Experimental and estimated saturated vapour pressures of aroma compounds,
Fluid Phase Equilibria, 1999, 157, 2, 257-270, https://doi.org/10.1016/S0378-3812(99)00016-3
. [all data]
Stephenson and Malanowski, 1987
Stephenson, Richard M.; Malanowski, Stanislaw,
Handbook of the Thermodynamics of Organic Compounds, 1987, https://doi.org/10.1007/978-94-009-3173-2
. [all data]