Propane, 2,2-diethoxy-
- Formula: C7H16O2
- Molecular weight: 132.2007
- IUPAC Standard InChIKey: FGQLGYBGTRHODR-UHFFFAOYSA-N
- CAS Registry Number: 126-84-1
- Chemical structure:
View 3d structure (requires JavaScript / HTML 5) - Other names: Acetone, diethyl acetal; Acetone diethyl ketal; 2,2-Diethoxypropane; USAF do-44

Gas phase thermochemistry data

Data compiled by: Donald R. Burgess, Jr.
Quantity | Value | Units | Method | Reference | Comment |
---|---|---|---|---|---|
ΔfH°gas | -506.7 | kJ/mol | N/A | Stern and Dorer, 1962 | Value computed using ΔfHliquid° value of -538.5±1 kj/mol from Stern and Dorer, 1962 and ΔvapH° value of 31.8 kj/mol from missing citation. |

Condensed phase thermochemistry data

Data compiled by: Hussein Y. Afeefy, Joel F. Liebman, and Stephen E. Stein
Quantity | Value | Units | Method | Reference | Comment |
---|---|---|---|---|---|
ΔfH°liquid | -538.5 ± 1.0 | kJ/mol | Cm | Stern and Dorer, 1962 | Reanalyzed by Cox and Pilcher, 1970, Original value = -536. ± 2. kJ/mol; Heat of hydrolysis |

Phase change data

Data compiled as indicated in comments:
BS - Robert L. Brown and Stephen E. Stein
TRC - Thermodynamics Research Center, NIST Boulder Laboratories, Chris Muzny director
AC - William E. Acree, Jr., James S. Chickos
ALS - Hussein Y. Afeefy, Joel F. Liebman, and Stephen E. Stein
Quantity | Value | Units | Method | Reference | Comment |
---|---|---|---|---|---|
Tboil | 386. | K | N/A | American Tokyo Kasei, 1988 | BS |
Quantity | Value | Units | Method | Reference | Comment |
Tfus | 207.9 | K | N/A | Anonymous, 1953 | Uncertainty assigned by TRC = 0.6 K; TRC |
Quantity | Value | Units | Method | Reference | Comment |
ΔvapH° | 43.2 ± 0.4 | kJ/mol | GS | Verevkin, 2002 | Based on data from 273. to 308. K.; AC |
ΔvapH° | 43.9 | kJ/mol | GS | Verevkin, Peng, et al., 1998 | Based on data from 273. to 308. K.; AC |
ΔvapH° | 31.8 | kJ/mol | V | Stern and Dorer, 1962 | Heat of hydrolysis; ALS |
Reduced pressure boiling point
Tboil (K) | Pressure (bar) | Reference | Comment |
---|---|---|---|
318.2 | 0.080 | Aldrich Chemical Company Inc., 1990 | BS |

Reaction thermochemistry data

Data compiled by: Hussein Y. Afeefy, Joel F. Liebman, and Stephen E. Stein
Individual Reactions
By formula: C7H16O2 + H2O = 2C2H6O + C3H6O
Quantity | Value | Units | Method | Reference | Comment |
---|---|---|---|---|---|
ΔrH° | 21.2 ± 0.2 | kJ/mol | Cm | Stern and Dorer, 1962 | liquid phase; Heat of hydrolysis |

References

Stern and Dorer, 1962
Stern, J.H.; Dorer, F.H.,
Standard heats of formation of 2,2-Dimethoxypropane (1), and 2,2 -Diethoxypropane (1). Group additivity theory and calculated heats of formation and five ketals,
J. Phys. Chem., 1962, 66, 97-99. [all data]
Cox and Pilcher, 1970
Cox, J.D.; Pilcher, G.,
Thermochemistry of Organic and Organometallic Compounds, Academic Press, New York, 1970, 1-636. [all data]
American Tokyo Kasei, 1988
American Tokyo Kasei,
TCI American Organic Chemical 88/89 Catalog, American Tokyo Kasei, Portland, OR, 1988, 1610. [all data]
Anonymous, 1953
Anonymous, R.,
, Physical Properties of Chemical Substances, Dow Chemical Company, 1953. [all data]
Verevkin, 2002
Verevkin, Sergey P.,
Improved Benson Increments for the Estimation of Standard Enthalpies of Formation and Enthalpies of Vaporization of Alkyl Ethers, Acetals, Ketals, and Ortho Esters,
J. Chem. Eng. Data, 2002, 47, 5, 1071-1097, https://doi.org/10.1021/je020023o
. [all data]
Verevkin, Peng, et al., 1998
Verevkin, S.P.; Peng, W.-H.; Beckhaus, H.D.; Rücuardt, C.,
Geminal substituent effects. 16. Does the anomeric effect in ketals depend on the hybridization of the central carbon atom?,
Eur. J. Org. Chem., 1998, 11, 2323. [all data]
Aldrich Chemical Company Inc., 1990
Aldrich Chemical Company Inc.,
Catalog Handbook of Fine Chemicals, Aldrich Chemical Company, Inc., Milwaukee WI, 1990, 1. [all data]