3-(Undecylthio)-1,2-propanediol
- Formula: C14H30O2S
- Molecular weight: 262.452
- IUPAC Standard InChIKey: GTHZTPLALWYVCC-UHFFFAOYSA-N
- CAS Registry Number: 126835-75-4
- Chemical structure:
View 3d structure (requires JavaScript / HTML 5) - Permanent link for this species. Use this link for bookmarking this species for future reference.

Phase change data

Data compiled by: William E. Acree, Jr., James S. Chickos
Enthalpy of fusion
ΔfusH (kJ/mol) | Temperature (K) | Reference |
---|---|---|
18.3 | 317.4 | Acree, 1993 |

References

Acree, 1993
Acree, William E.,
Thermodynamic properties of organic compounds,
Thermochimica Acta, 1993, 219, 97-104, https://doi.org/10.1016/0040-6031(93)80486-T
. [all data]