Tributyl phosphate
- Formula: C12H27O4P
- Molecular weight: 266.3141
- IUPAC Standard InChIKey: STCOOQWBFONSKY-UHFFFAOYSA-N
- CAS Registry Number: 126-73-8
- Chemical structure:
View 3d structure (requires JavaScript / HTML 5) - Other names: TBP; Phosphoric acid tributyl ester; Butyl phosphate; Celluphos 4; Disflamoll TB; Tri-n-butyl phosphate; Tributoxyphosphine oxide; Butyl phosphate, ((BuO)3PO); Butyl phosphate, tri-; Tributilfosfato; Tributyle (phosphate de); Tributylfosfaat; Tributylphosphat; Tributylfosfat; Tributylphsophate; Tributyl ester of phosphoric acid; Kronitex TBP; Phosphoric acid tri-n-butyl ester; Syn-O-Ad 8412; NSC 8484; tributhyl phosphate

Condensed phase thermochemistry data

Data compiled by: Eugene S. Domalski and Elizabeth D. Hearing
Constant pressure heat capacity of liquid
Cp,liquid (J/mol*K) | Temperature (K) | Reference | Comment |
---|---|---|---|
379.4 | 298.15 | Nazar'ko, Rudakov, et al., 1981 | T = 283 to 423 K. Cp given as 1.404 J/g*K at 20°C and 1.445 J/g*K at 30°C. |

Phase change data

Data compiled by: William E. Acree, Jr., James S. Chickos
Quantity | Value | Units | Method | Reference | Comment |
---|---|---|---|---|---|
ΔvapH° | 81.3 | kJ/mol | CGC | Panneerselvam, Antony, et al., 2007 | Based on data from 443. to 483. K. |
ΔvapH° | 78.8 | kJ/mol | CGC | Panneerselvam, Antony, et al., 2007 | Based on data from 423. to 463. K. |
ΔvapH° | 81.7 | kJ/mol | CGC | Panneerselvam, Antony, et al., 2007 | Based on data from 453. to 493. K. |
Enthalpy of vaporization
ΔvapH (kJ/mol) | Temperature (K) | Method | Reference | Comment |
---|---|---|---|---|
61.4 | 515. | A | Stephenson and Malanowski, 1987 | Based on data from 500. to 562. K. |

Kovats' RI, non-polar column, isothermal

Column type | Active phase | Temperature (C) | I | Reference | Comment |
---|---|---|---|---|---|
Capillary | Methyl Silicone | 120. | 1613. | Huber, Kenndler, et al., 1993 | H2; Column length: 5. m; Phase thickness: 2.65 μm |
Capillary | Methyl Silicone | 180. | 1612. | Huber, Kenndler, et al., 1993 | H2; Column length: 5. m; Phase thickness: 2.65 μm |
Capillary | Methyl Silicone | 200. | 1612. | Huber, Kenndler, et al., 1993 | H2; Column length: 5. m; Phase thickness: 2.65 μm |
Packed | SE-30 | 180. | 1619. | Golovkin, Smol'chenko, et al., 1980 | N2, Chromaton N-AW-DMCS; Column length: 1. m |
Packed | SE-30 | 220. | 1663. | Zulaïca and Guiochon, 1963 | Column length: 2. m |

Kovats' RI, non-polar column, temperature ramp

Column type | Active phase | I | Reference | Comment |
---|---|---|---|---|
Capillary | DB-1 | 1619. | Takeoka, Perrino, et al., 1996 | 60. m/0.25 mm/0.25 μm, 30. C @ 4. min, 2. K/min; Tend: 220. C |

Kovats' RI, polar column, isothermal

Column type | Active phase | Temperature (C) | I | Reference | Comment |
---|---|---|---|---|---|
Capillary | PEG-20M | 190. | 2117. | Huber, Kenndler, et al., 1993 | Column length: 10. m; Phase thickness: 1.33 μm |
Capillary | PEG-20M | 210. | 2118. | Huber, Kenndler, et al., 1993 | Column length: 10. m; Phase thickness: 1.33 μm |
Capillary | PEG-20M | 130. | 2114.2 | Huber, Kenndler, et al., 1993 | Column length: 10. m; Phase thickness: 1.33 μm |

Van Den Dool and Kratz RI, non-polar column, temperature ramp

Column type | Active phase | I | Reference | Comment |
---|---|---|---|---|
Capillary | DB-1 | 1613. | Johnson, Urso, et al., 1997 | 30. m/0.2 mm/0.25 μm, 50. C @ 2. min, 5. K/min, 300. C @ 5. min |
Capillary | DB-1 | 1622. | Peng, Hua, et al., 1992 | 30. m/0.32 mm/1.5 μm, 40. C @ 4. min, 8. K/min; Tend: 280. C |
Capillary | DB-1 | 1616. | Hancock and Peters, 1991 | He, 50. C @ 2. min, 10. K/min; Column length: 15. m; Column diameter: 0.53 mm |
Capillary | DB-5 | 1638.7 | Hancock and Peters, 1991 | He, 50. C @ 2. min, 10. K/min; Column length: 15. m; Column diameter: 0.53 mm |
Capillary | DB-5 | 1647.4 | Hancock and Peters, 1991 | He, 50. C @ 2. min, 10. K/min; Column length: 15. m; Column diameter: 0.53 mm |
Capillary | DB-5 | 1647.9 | Hancock and Peters, 1991 | He, 50. C @ 2. min, 10. K/min; Column length: 15. m; Column diameter: 0.53 mm |
Packed | SE-30 | 1623. | Helaimia and Messadi, 1989 | Chromosorb Q, 10. K/min; Column length: 2. m; Tstart: 100. C |
Packed | SE-30 | 1636. | Helaimia and Messadi, 1989 | Chromosorb Q, 10. K/min; Column length: 2. m; Tstart: 100. C |
Capillary | DB-1 | 1615.7 | D'Agostino and Provost, 1985 | 15. m/0.32 mm/0.25 μm, He, 50. C @ 2. min, 10. K/min, 300. C @ 5. min |
Capillary | DB-5 | 1658.8 | D'Agostino and Provost, 1985 | 15. m/0.32 mm/0.25 μm, He, 50. C @ 2. min, 10. K/min; Tend: 300. C |
Packed | SE-30 | 1623. | Messadi and Vergnaud, 1979 | N2, Chromosorb Q, 10. K/min; Tstart: 100. C; Tend: 340. C |

Van Den Dool and Kratz RI, non-polar column, custom temperature program

Column type | Active phase | I | Reference | Comment |
---|---|---|---|---|
Capillary | HP-5MS | 1662. | Hankemeier, Rozenbrand, et al., 1998 | Program: not specified |
Capillary | HP-5MS | 1663. | Hankemeier, Rozenbrand, et al., 1998 | Program: not specified |
Capillary | OV-101 | 1617. | Yasuhara, Shiraishi, et al., 1997 | 15. m/0.25 mm/0.25 μm, He; Program: 50C(2min) => (20C/min) => 120C => (7C/min) => 310C(10min) |
Capillary | 5 % Phenyl methyl siloxane | 1655. | Yasuhara, Shiraishi, et al., 1997 | 25. m/0.31 mm/0.52 μm, He; Program: 50C(2min) => (20C/min) => 120C => (7C/min) => 310C(10min) |

Van Den Dool and Kratz RI, polar column, temperature ramp

Column type | Active phase | I | Reference | Comment |
---|---|---|---|---|
Capillary | DB-Wax | 2075. | Peng, Hua, et al., 1992 | 30. m/0.53 mm/1. μm, 40. C @ 4. min, 8. K/min, 200. C @ 20. min |
Capillary | DB-Wax | 2157.4 | D'Agostino and Provost, 1985 | 15. m/0.32 mm/0.25 μm, He, 50. C @ 2. min, 10. K/min, 250. C @ 5. min |

Normal alkane RI, non-polar column, temperature ramp

Column type | Active phase | I | Reference | Comment |
---|---|---|---|---|
Capillary | Ultra-1 | 1615. | Okumura, 1991 | 25. m/0.32 mm/0.25 μm, He, 3. K/min; Tstart: 80. C; Tend: 260. C |

Normal alkane RI, non-polar column, custom temperature program

Column type | Active phase | I | Reference | Comment |
---|---|---|---|---|
Capillary | DB-5 | 1642. | Soderstrom, White, et al., 2001 | Program: not specified |
Capillary | DB-5 | 1644. | Soderstrom, White, et al., 2001 | Program: not specified |
Capillary | DB-5 | 1649. | Soderstrom, White, et al., 2001 | Program: not specified |
Capillary | DB-5 | 1655. | Soderstrom, White, et al., 2001 | Program: not specified |
Capillary | DB-5 | 1655. | Soderstrom, White, et al., 2001 | Program: not specified |
Capillary | Methyl Silicone | 1621. | Zenkevich, 1999 | Program: not specified |
Capillary | OV-101 | 1620. | Zenkevich and Malamakhov, 1987 | He; Column length: 50. m; Column diameter: 0.24 mm; Program: not specified |
Capillary | OV-1 | 1614. | Waggott and Davies, 1984 | Hydrogen; Column length: 50. m; Column diameter: 0.32 mm; Program: not specified |
Capillary | OV-1, SE-30, Methyl silicone, SP-2100, OV-101, DB-1, etc. | 1616. | Waggott and Davies, 1984 | Hydrogen; Column length: 50. m; Column diameter: 0.32 mm; Program: not specified |

Normal alkane RI, polar column, custom temperature program

Column type | Active phase | I | Reference | Comment |
---|---|---|---|---|
Capillary | Superox 0.6; Carbowax 20M | 2079. | Waggott and Davies, 1984 | Hydrogen; Column length: 50. m; Column diameter: 0.32 mm; Program: not specified |
Capillary | Carbowax 400, Carbowax 20M, Carbowax 1540, Carbowax 4000, Superox 06, PEG 20M, etc. | 2079. | Waggott and Davies, 1984 | Hydrogen; Column length: 50. m; Column diameter: 0.32 mm; Program: not specified |

Lee's RI, non-polar column, temperature ramp

Column type | Active phase | I | Reference | Comment |
---|---|---|---|---|
Capillary | DB-1 | 283.2 | Johnson, Urso, et al., 1997 | 30. m/0.2 mm/0.25 μm, 50. C @ 2. min, 5. K/min, 300. C @ 5. min |

Lee's RI, non-polar column, custom temperature program

Column type | Active phase | I | Reference | Comment |
---|---|---|---|---|
Capillary | Methyl Silicone | 278.79 | Eckel, Ross, et al., 1993 | Program: not specified |

References

Nazar'ko, Rudakov, et al., 1981
Nazar'ko, V.M.; Rudakov, G.Ya.; Magomadov, A.S.; Demichev, A.I.,
Thermophysical properties of tri-n-butyl phosphate mercaptan absorbent, Gazov. Prom-st.,
Ser.: Podgot. Pererab. Gaza Gazov. Kondens., 1981, No. 3, 13-16. [all data]
Panneerselvam, Antony, et al., 2007
Panneerselvam, K.; Antony, M.P.; Srinivasan, T.G.; Rao, P.R. Vasudeva,
Measurement of enthalpies of vaporization of trialkyl phosphates using correlation gas chromatography,
Thermochimica Acta, 2007, 466, 1-2, 49-56, https://doi.org/10.1016/j.tca.2007.10.007
. [all data]
Stephenson and Malanowski, 1987
Stephenson, Richard M.; Malanowski, Stanislaw,
Handbook of the Thermodynamics of Organic Compounds, 1987, https://doi.org/10.1007/978-94-009-3173-2
. [all data]
Huber, Kenndler, et al., 1993
Huber, J.F.K.; Kenndler, E.; Reich, G.; Hack, W.; Wolf, J.,
Optimal Selection of Gas Chromatographic Columns for the Analytical Control of Chemical Warfare Agents by Application of Information Theory to Retention Data,
Anal. Chem., 1993, 65, 20, 2903-2906, https://doi.org/10.1021/ac00068a031
. [all data]
Golovkin, Smol'chenko, et al., 1980
Golovkin, G.V.; Smol'chenko, A.I.; Zotov, L.N.; Sazonov, S.E.,
Systems of gas-chromatographic retention indices for identifying pesticides by means of selective detectors,
Zh. Anal. Khim., 1980, 35, 5, 651-655. [all data]
Zulaïca and Guiochon, 1963
Zulaïca, J.; Guiochon, G.,
Séparation et identification de di-esters aliphatiques et aromatiques et de trimesters phosphoriques par chromatographie en phase gazeuse,
Bull. Soc. Chim. Fr., 1963, 6, 1242-1252. [all data]
Takeoka, Perrino, et al., 1996
Takeoka, G.; Perrino, C., Jr.; Buttery, R.,
Volatile constituents of used frying oils,
J. Agric. Food Chem., 1996, 44, 3, 654-660, https://doi.org/10.1021/jf950430m
. [all data]
Johnson, Urso, et al., 1997
Johnson, C.I.; Urso, A.; Geleta, L.,
Broad spectrum analysis of municipal and industrial effluents discharged into the Peace, Athabasca and Slave river basins: characterization of effluent samples, 1994 - Volume 1 of 2, Northern River Basins Study Project Report No. 121, Norther River Basins Study, Edmonton, Alberta, 1997, 27. [all data]
Peng, Hua, et al., 1992
Peng, C.T.; Hua, R.L.; Maltby, D.,
Prediction of retention indexes. IV. Chain branching in alkylbenzene isomers with C10-13 alkyl chains identified in a scintillator solvent,
J. Chromatogr., 1992, 589, 1-2, 231-239, https://doi.org/10.1016/0021-9673(92)80027-R
. [all data]
Hancock and Peters, 1991
Hancock, J.R.; Peters, G.R.,
Retention index monitoring of compounds of chemical defence interest using thermal desorption gas chromatography,
J. Chromatogr., 1991, 538, 2, 249-257, https://doi.org/10.1016/S0021-9673(01)88845-2
. [all data]
Helaimia and Messadi, 1989
Helaimia, F.; Messadi, D.,
Determination of linear programmed temperature gas chromatography retention indices for some plasticizers,
C.R. Acad. Sci. Ser. 2:, 1989, 309, 37-42. [all data]
D'Agostino and Provost, 1985
D'Agostino, P.A.; Provost, L.R.,
Gas chromatographic retention indices of chemical warfare agents and simulants,
J. Chromatogr., 1985, 331, 47-54, https://doi.org/10.1016/0021-9673(85)80005-4
. [all data]
Messadi and Vergnaud, 1979
Messadi, D.; Vergnaud, J.-M.,
Quick identification and analysis of plasticizers in PVC by programmed-temperature gas chromatography using the best stationary phases,
J. Appl. Polym. Sci., 1979, 24, 5, 1215-1225, https://doi.org/10.1002/app.1979.070240507
. [all data]
Hankemeier, Rozenbrand, et al., 1998
Hankemeier, Th.; Rozenbrand, J.; Abhadur, M.; Vreuls, J.J.; Brinkman, U.A.Th.,
Data Correlation in On-Line Solid-Phase Extraction - Gas Chromatography - Atomic Emission / Mass Spectrometric Detection of Unknown Microcontaminants,
Chromatographia, 1998, 48, 3/4, 273-283, https://doi.org/10.1007/BF02467683
. [all data]
Yasuhara, Shiraishi, et al., 1997
Yasuhara, A.; Shiraishi, H.; Nishikawa, M.; Yamamoto, T.; Uehiro, T.; Nakasugi, O.; Okumura, T.; Kenmotsu, K.; Fukui, H.; Nagase, M.; Ono, Y.; Kawagoshi, Y.; Baba, K.; Noma, Y.,
Determination of organic components in leachates from hazardous waste disposal sites in Japan by gas chromatography-mass spectrometry,
J. Chromatogr. A, 1997, 774, 1-2, 321-332, https://doi.org/10.1016/S0021-9673(97)00078-2
. [all data]
Okumura, 1991
Okumura, T.,
retention indices of environmental chemicals on methyl silicone capillary column,
Journal of Environmental Chemistry (Japan), 1991, 1, 2, 333-358, https://doi.org/10.5985/jec.1.333
. [all data]
Soderstrom, White, et al., 2001
Soderstrom, M.; White, E.; Abis, L.; Sliwakowski, M.,
Summary report of the eight meeting of the validation group for the updating of the central OPCW analytical database, 28-29 November 2000, CS-2001-2242, Verification Division S/239/2001, 2001, 14. [all data]
Zenkevich, 1999
Zenkevich, I.G.,
Precalculation of Gas Chromatographic Retention Indices of Organic Compounds from Boiling Points of their Structural Analogues,
Zh. Struct. Khim., 1999, 40, 1, 121-130. [all data]
Zenkevich and Malamakhov, 1987
Zenkevich, I.G.; Malamakhov, A.C.,
Evaluation of Molecular Weights of Organic Compounds based on Retention Parameters at Chromato-Spectral Analysys. Additional Criterion of Molecular Ions' Identification,
Vestn. St. Petersb. Univ. Ser. 4: Fiz. Khim, 1987, 2, 101-106. [all data]
Waggott and Davies, 1984
Waggott, A.; Davies, I.W.,
Identification of organic pollutants using linear temperature programmed retention indices (LTPRIs) - Part II, 1984, retrieved from http://dwi.defra.gov.uk/research/completed-research/reports/dwi0383.pdf. [all data]
Eckel, Ross, et al., 1993
Eckel, W.P.; Ross, B.; Isensee, R.K.,
Pentobarbital found in ground water,
Ground Water, 1993, 31, 5, 801-804, https://doi.org/10.1111/j.1745-6584.1993.tb00853.x
. [all data]