Neopentyl glycol

Reaction thermochemistry data

Data compiled by: Hussein Y. Afeefy, Joel F. Liebman, and Stephen E. Stein

Individual Reactions

Neopentyl glycol + Acetone = 1,3 Dioxane, 2,2,5,5-tetramethyl- + Water

By formula: C5H12O2 + C3H6O = C8H16O2 + H2O

Quantity Value Units Method Reference Comment
Δr-11.kJ/molEqkAnteunis and Rommelaere, 1970liquid phase

References

Anteunis and Rommelaere, 1970
Anteunis, M.; Rommelaere, Y., NMR experiments on acetals. XXIX. The ease of acetonide formation of some glycols, Bull. Soc. Chim. Belg., 1970, 79, 523-530. [all data]