1,2-Dibromoethane-d2(1,2)
- Formula: C2H2D2Br2
- Molecular weight: 189.873
- IUPAC Standard InChIKey: PAAZPARNPHGIKF-QDNHWIQGSA-N
- CAS Registry Number: 126266-42-0
- Chemical structure:
View 3d structure (requires JavaScript / HTML 5) - Isotopologues:

Condensed phase thermochemistry data

Data compiled by: Eugene S. Domalski and Elizabeth D. Hearing
Constant pressure heat capacity of liquid
Cp,liquid (J/mol*K) | Temperature (K) | Reference |
---|---|---|
141.6 | 293. | D'hont and Jungers, 1949 |

References

D'hont and Jungers, 1949
D'hont, M.; Jungers, J.C.,
La chaleur molaire des 1,1'-dibromethanes et 1,1',2-tribromethanes en phase liquide,
Bull. Soc. Chim. Belg., 1949, 58, 196-204. [all data]