Bis(triphenyltin) oxide
- Formula: C36H30OSn2
- Molecular weight: 716.043
- IUPAC Standard InChIKey: MUHFQLVFMFDJOK-UHFFFAOYSA-N
- CAS Registry Number: 1262-21-1
- Chemical structure:

Condensed phase thermochemistry data

Data compiled by: José A. Martinho Simões
Quantity | Value | Units | Method | Reference | Comment |
---|---|---|---|---|---|
ΔfH°solid | 422. ± 11. | kJ/mol | Review | Martinho Simões | |
Quantity | Value | Units | Method | Reference | Comment |
ΔcH°solid | -20031. ± 10. | kJ/mol | CC-SB | Carson, Franklin, et al., 1975 |

Phase change data

Data compiled by: José A. Martinho Simões
Quantity | Value | Units | Method | Reference | Comment |
---|---|---|---|---|---|
ΔsubH° | 196.6 ± 8.4 | kJ/mol | CC-SB | Carson, Franklin, et al., 1975 |

Gas phase thermochemistry data

Data compiled by: José A. Martinho Simões
Quantity | Value | Units | Method | Reference | Comment |
---|---|---|---|---|---|
ΔfH°gas | 619. ± 14. | kJ/mol | Review | Martinho Simões |

References

Martinho Simões
Martinho Simões, J.A.,
Private communication (see http://webbook.nist.gov/chemistry/om/). [all data]
Carson, Franklin, et al., 1975
Carson, A.S.; Franklin, J.; Laye, P.G.; Morris, H.,
J. Chem. Thermodyn., 1975, 7, 763. [all data]