1,3-Propanediol, 2-(hydroxymethyl)-2-nitro-
- Formula: C4H9NO5
- Molecular weight: 151.1180
- IUPAC Standard InChIKey: OLQJQHSAWMFDJE-UHFFFAOYSA-N
- CAS Registry Number: 126-11-4
- Chemical structure:
View 3d structure (requires JavaScript / HTML 5) - Other names: Isobutylglycerol, nitro-; Methane, trimethylolnitro-; Nitroisobutylglycerol; Nitrotris(hydroxymethyl)methane; Trihydroxymethylnitromethane; Trimethylolnitromethane; Tris Nitro; Tris(hydroxymethyl)nitromethane; 1,1,1-Tris(hydroxymethyl)nitromethane; 2-(Hydroxymethyl)-2-nitropropanediol; 2-(Hydroxymethyl)-2-nitro-1,3-propanediol; Cimcool wafers; 2-(Hydroxymethyl)-2-nitropropane-1,3-diol; 2-Nitro-2-(hydroxymethyl)-1,3-propanediol; Nitrotrimethylolmethane; NSC 17675; nitromethylidynetrimethanol

Condensed phase thermochemistry data

Data compiled by: Hussein Y. Afeefy, Joel F. Liebman, and Stephen E. Stein
Quantity | Value | Units | Method | Reference | Comment |
---|---|---|---|---|---|
ΔfH°solid | -742.2 | kJ/mol | Ccb | Medard and Thomas, 1953 | Heat of combustion corrected for pressure |
ΔfH°solid | -729.4 ± 3.1 | kJ/mol | Ccb | Currie, Bennett, et al., 1952 | see Currie, 1950 |
Quantity | Value | Units | Method | Reference | Comment |
ΔcH°solid | -2118. | kJ/mol | Ccb | Medard and Thomas, 1953 | Heat of combustion corrected for pressure |
ΔcH°solid | -2131.0 ± 3.1 | kJ/mol | Ccb | Currie, Bennett, et al., 1952 | see Currie, 1950 |

Phase change data

Data compiled by: Eugene S. Domalski and Elizabeth D. Hearing
Enthalpy of phase transition
ΔHtrs (kJ/mol) | Temperature (K) | Initial Phase | Final Phase | Reference | Comment |
---|---|---|---|---|---|
22.446 | 354. | crystaline, II | crystaline, I | Murrill and Breed, 1970 | 457 K Decomposition. |
Entropy of phase transition
ΔStrs (J/mol*K) | Temperature (K) | Initial Phase | Final Phase | Reference | Comment |
---|---|---|---|---|---|
63.6 | 354. | crystaline, II | crystaline, I | Murrill and Breed, 1970 | 457 |

References

Medard and Thomas, 1953
Medard, L.; Thomas, M.,
Determination des chaleurs de combustion de treize substances explosives ou apparentees a des explosifs,
Mem. Poudres, 1953, 35, 155-173. [all data]
Currie, Bennett, et al., 1952
Currie, R.M.; Bennett, C.O.; Holcomb, D.E.,
Heats of combustion of some nitro alcohols,
Ind. Eng. Chem., 1952, 44, 329-331. [all data]
Currie, 1950
Currie, R.M.,
Heats of combustion of some nitroalcohols, Thesis for Purdue University, 1950, 1-84. [all data]
Murrill and Breed, 1970
Murrill, E.; Breed, L.,
Solid-solid phase transitions determined by differential scanning calorimetry,
Thermochim. Acta, 1970, 1, 239-246. [all data]