CAS Reg. No. 12599-09-6
- CAS Registry Number: 12599-09-6

Reaction thermochemistry data

Data compiled by: John E. Bartmess
Individual Reactions
(CAS Reg. No. 12599-09-6 • 4294967295) +
= CAS Reg. No. 12599-09-6
By formula: (CAS Reg. No. 12599-09-6 • 4294967295Cl) + Cl = CAS Reg. No. 12599-09-6
Quantity | Value | Units | Method | Reference | Comment |
---|---|---|---|---|---|
ΔrH° | 172. ± 7.1 | kJ/mol | CIDT | Lobring, Check, et al., 2005 | gas phase; Affinity is Cl.. POCl2- |

References

Lobring, Check, et al., 2005
Lobring, K.C.; Check, C.E.; Boggs, M.L.; Keating, P.R.; Sunderlin, L.S.,
Bond strengths in POCl3-, POCl2-, and PSCl2-,
Int. J. Mass Spectrom., 2005, 241, 1, 75-81, https://doi.org/10.1016/j.ijms.2004.10.023
. [all data]