Selenium anion
- Formula: Se2-
- Molecular weight: 157.92
- CAS Registry Number: 12597-21-6

Reaction thermochemistry data

Data compiled by: John E. Bartmess
Individual Reactions
By formula: (Se2- • 4294967295Se) + Se = Se2-
Quantity | Value | Units | Method | Reference | Comment |
---|---|---|---|---|---|
ΔrH° | 300. ± 13. | kJ/mol | N/A | Snodgrass, Coe, et al., 1989 | gas phase |

Ion clustering data

Data compiled by: John E. Bartmess
Clustering reactions
By formula: (Se2- • 4294967295Se) + Se = Se2-
Quantity | Value | Units | Method | Reference | Comment |
---|---|---|---|---|---|
ΔrH° | 300. ± 13. | kJ/mol | N/A | Snodgrass, Coe, et al., 1989 | gas phase |

References

Snodgrass, Coe, et al., 1989
Snodgrass, J.T.; Coe, J.V.; McHugh, K.M.; Freidhoff, C.B.; Bowen, K.H.,
Photoelectron Spectroscopy of the Selenium and Tellurium Containing Negative Ions: SeO2-, Se2- and Te2-,
J. Phys. Chem., 1989, 93, 4, 1249, https://doi.org/10.1021/j100341a016
. [all data]