CAS Reg. No. 12595-33-4
- CAS Registry Number: 12595-33-4

Reaction thermochemistry data

Data compiled by: John E. Bartmess
Individual Reactions
(CAS Reg. No. 12595-33-4 • 4294967295) +
= CAS Reg. No. 12595-33-4
By formula: (CAS Reg. No. 12595-33-4 • 4294967295Ag) + Ag = CAS Reg. No. 12595-33-4
Quantity | Value | Units | Method | Reference | Comment |
---|---|---|---|---|---|
ΔrH° | 57.2 ± 1.8 | kcal/mol | LPD | Shi, Spasov, et al., 1999 | gas phase |
ΔrH° | 63.0 ± 2.3 | kcal/mol | CIDT | Spasov, Lee, et al., 1999 | gas phase; For Ag6- loss; Ag5- loss comparable. |

References

Shi, Spasov, et al., 1999
Shi, Y.; Spasov, V.A.; Ervin, K.M.,
Competitive fragmentation and electron loss kinetics of photoactivated silver cluster anions: Dissociation energies of Ag-n(-) (n=7-11),
J. Chem. Phys., 1999, 111, 3, 938-949, https://doi.org/10.1063/1.479186
. [all data]
Spasov, Lee, et al., 1999
Spasov, V.A.; Lee, T.H.; Maberry, J.P.; Ervin, K.M.,
Measurement of the dissociation energies of anionic silver clusters (Ag-n(-), n = 2-11) by collision-induced dissociation,
J. Chem. Phys., 1999, 110, 11, 5208-5217, https://doi.org/10.1063/1.478416
. [all data]