CAS Reg. No. 12595-28-7
- CAS Registry Number: 12595-28-7

Reaction thermochemistry data

Data compiled by: John E. Bartmess
Individual Reactions
(CAS Reg. No. 12595-28-7 • 4294967295) +
= CAS Reg. No. 12595-28-7
By formula: (CAS Reg. No. 12595-28-7 • 4294967295Ag) + Ag = CAS Reg. No. 12595-28-7
Quantity | Value | Units | Method | Reference | Comment |
---|---|---|---|---|---|
ΔrH° | 31.4 ± 5.5 | kcal/mol | CIDT | Spasov, Lee, et al., 1999 | gas phase; For Ag3- loss; Ag2- loss ca. 0.3 eV higher. |

References

Spasov, Lee, et al., 1999
Spasov, V.A.; Lee, T.H.; Maberry, J.P.; Ervin, K.M.,
Measurement of the dissociation energies of anionic silver clusters (Ag-n(-), n = 2-11) by collision-induced dissociation,
J. Chem. Phys., 1999, 110, 11, 5208-5217, https://doi.org/10.1063/1.478416
. [all data]