Vinbarbital
- Formula: C11H16N2O3
- Molecular weight: 224.2563
- IUPAC Standard InChIKey: RAFOHKSPUDGZPR-VOTSOKGWSA-N
- CAS Registry Number: 125-42-8
- Chemical structure:
View 3d structure (requires JavaScript / HTML 5) - Other names: 2,4,6(1H,3H,5H)-Pyrimidinetrione, 5-ethyl-5-(1-methyl-1-butenyl)-; Barbituric acid, 5-ethyl-5-(1-methyl-1-butenyl)-; Butenemal; Delvinal; Vinbarbitone; Devinal; Suppoptanox; 5-Ethyl-5-(1-methyl-1-butenyl)barbituric acid; 5-Ethyl-5-(1-methyl-1-butenyl)-2,4,6(1H,3H,5H)-pyrimidinetrione; 5-Ethyl-5-(1-methyl-1-butenyl)barbiturate; NSC 117442

Phase change data

Data compiled by: Thermodynamics Research Center, NIST Boulder Laboratories, Chris Muzny director
Quantity | Value | Units | Method | Reference | Comment |
---|---|---|---|---|---|
Tfus | 439. | K | N/A | Grady, Hays, et al., 1973 | Uncertainty assigned by TRC = 1. K |
Tfus | 436. | K | N/A | Kuffner, Bush, et al., 1957 | Uncertainty assigned by TRC = 4. K; not clear that this was measured by author |

Kovats' RI, non-polar column, isothermal

Data compiled by: NIST Mass Spectrometry Data Center, William E. Wallace, director

Column type PackedPacked
Active phase SE-30OV-1
Column length (m)
Carrier gas
Substrate
Column diameter (mm)
Phase thickness (μm)
Temperature (C) 200.200.
I 1755.1725.
ReferenceStead, Gill, et al., 1982Berninger and Möller, 1977
Comment MSDC-RI MSDC-RI

References

Grady, Hays, et al., 1973
Grady, L.T.; Hays, S.E.; King, R.H.; Klein, H.R.; Mader, W.J.; Wyatt, D.K.; Zimmere, R.O.,
Drug purity profiles,
J. Pharm. Sci., 1973, 62, 459. [all data]
Kuffner, Bush, et al., 1957
Kuffner, R.J.; Bush, M.T.; Bircher, L.J.,
Studies on the surface tension of aqueous barbituric acid solutions,
J. Am. Chem. Soc., 1957, 79, 1587-1589. [all data]