F(CH3)Si=CH2
- Formula: C2H5FSi
- Molecular weight: 76.1450
- IUPAC Standard InChIKey: BXYUDSGZQDXZFU-UHFFFAOYSA-N
- CAS Registry Number: 125413-85-6
- Chemical structure:
View 3d structure (requires JavaScript / HTML 5) - Permanent link for this species. Use this link for bookmarking this species for future reference.

Reaction thermochemistry data

Data compiled by: Michael M. Meot-Ner (Mautner) and Sharon G. Lias
Individual Reactions
By formula: F- + C2H5FSi = (F- • C2H5FSi)
Quantity | Value | Units | Method | Reference | Comment |
---|---|---|---|---|---|
ΔrH° | 170. ± 8. | kJ/mol | ICR | Allison and McMahon, 1990 | gas phase; bracketing |

Gas phase ion energetics data

Data evaluated by: Edward P. Hunter and Sharon G. Lias
Quantity | Value | Units | Method | Reference | Comment |
---|---|---|---|---|---|
Proton affinity (review) | 771.1 | kJ/mol | N/A | Hunter and Lias, 1998 | |
Quantity | Value | Units | Method | Reference | Comment |
Gas basicity | 742.2 | kJ/mol | N/A | Hunter and Lias, 1998 |

Ion clustering data

Data compiled by: Michael M. Meot-Ner (Mautner) and Sharon G. Lias
Clustering reactions
By formula: F- + C2H5FSi = (F- • C2H5FSi)
Quantity | Value | Units | Method | Reference | Comment |
---|---|---|---|---|---|
ΔrH° | 170. ± 8. | kJ/mol | ICR | Allison and McMahon, 1990 | gas phase; bracketing |

References

Allison and McMahon, 1990
Allison, C.E.; McMahon, T.B.,
How Strong is the Si=C Bond in Fluoro- and Methyl Substituted Silaethylenes? An Experimental Determination of Pi Bond Strengths,
J. Am. Chem. Soc., 1990, 112, 5, 1672, https://doi.org/10.1021/ja00161a002
. [all data]
Hunter and Lias, 1998
Hunter, E.P.; Lias, S.G.,
Evaluated Gas Phase Basicities and Proton Affinities of Molecules: An Update,
J. Phys. Chem. Ref. Data, 1998, 27, 3, 413-656, https://doi.org/10.1063/1.556018
. [all data]