Cyanogen cation
- Formula: CN+
- Molecular weight: 26.0169
- IUPAC Standard InChIKey: NKCCODPFBDGPRJ-UHFFFAOYSA-N
- CAS Registry Number: 12539-57-0
- Chemical structure:
View 3d structure (requires JavaScript / HTML 5) - Permanent link for this species. Use this link for bookmarking this species for future reference.

Gas phase thermochemistry data

Quantity | Value | Units | Method | Reference | Comment |
---|---|---|---|---|---|
S°gas,1 bar | 213.44 | J/mol*K | Review | Chase, 1998 | Data last reviewed in December, 1970 |

Constants of diatomic molecules

Data compiled by: Klaus P. Huber and Gerhard H. Herzberg
Data collected through September, 1976
Symbol | Meaning |
---|---|
State | electronic state and / or symmetry symbol |
Te | minimum electronic energy (cm-1) |
ωe | vibrational constant – first term (cm-1) |
ωexe | vibrational constant – second term (cm-1) |
ωeye | vibrational constant – third term (cm-1) |
Be | rotational constant in equilibrium position (cm-1) |
αe | rotational constant – first term (cm-1) |
γe | rotation-vibration interaction constant (cm-1) |
De | centrifugal distortion constant (cm-1) |
βe | rotational constant – first term, centrifugal force (cm-1) |
re | internuclear distance (Å) |
Trans. | observed transition(s) corresponding to electronic state |
ν00 | position of 0-0 band (units noted in table) |
State | Te | ωe | ωexe | ωeye | Be | αe | γe | De | βe | re | Trans. | ν00 |
---|---|---|---|---|---|---|---|---|---|---|---|---|
d 1Π | (a + 46253) | [890.76] Z | 1 | [1.6018] | 2 | [0.0000195] 2 | [1.2762] | d → b 3 R | 37544.49 Z | |||
↳missing citation; missing citation | ||||||||||||
f 1Σ | a + 45533.6 | 2670.5 Z | 46.9 | 1.903 4 | 0.032 | [0.0000047] | 1.171 | f → b V | 37703.14 Z | |||
↳missing citation | ||||||||||||
f → a 5 | 45844.65 Z | |||||||||||
↳missing citation | ||||||||||||
c 1Σ | (a + 31771) | (1265) 6 | (11) | (1.403) 6 | (0.002) | [0.000013] | (1.364) | c → a R | 31381.60 6 Z | |||
↳missing citation | ||||||||||||
State | Te | ωe | ωexe | ωeye | Be | αe | γe | De | βe | re | Trans. | ν00 |
b 1Π | a + 8313.6 | 1688.35 Z | 15.12 | 1.6767 | 0.0191 | -0.0005 | [0.00000684] | 1.2473 | ||||
a 1Σ | a | 2033.05 Z | 16.14 | 1.8964 | 0.0188 | [7.0E-06] | 1.1729 |

References

Chase, 1998
Chase, M.W., Jr.,
NIST-JANAF Themochemical Tables, Fourth Edition,
J. Phys. Chem. Ref. Data, Monograph 9, 1998, 1-1951. [all data]
Smith, 1969
Smith, W.H.,
Radiative Lifetimes and Total Transition Probabilities for Some Polyatomic Species,
J. Chem. Phys., 1969, 51, 8, 3410, https://doi.org/10.1063/1.1672528
. [all data]
Mulliken, 1960
Mulliken, R.S.,
Some neglected subcases of predissociation in diatomic molecules,
J. Chem. Phys., 1960, 33, 247. [all data]