NNO2 anion

Ion clustering data

Data compiled by: John E. Bartmess

Clustering reactions

(N2O2- • 4294967295Nitrous oxide) + Nitrous oxide = N2O2-

By formula: (N2O2- • 4294967295N2O) + N2O = N2O2-

Quantity Value Units Method Reference Comment
Δr23.1 ± 1.2kcal/molN/ALi and Continetti, 2002gas phase
Δr32.30 ± 0.70kcal/molLPDOsboen, Leahy, et al., 1996gas phase; Affinity at 0 K

References

Li and Continetti, 2002
Li, R.J.; Continetti, R.E., Studies of the excited state dynamics of N2O2 by dissociative photodetachment of N2O2-, J. Phys. Chem. A, 2002, 106, 7, 1183-1189, https://doi.org/10.1021/jp013330u . [all data]

Osboen, Leahy, et al., 1996
Osboen, D.L.; Leahy, D.J.; Cyr, D.R.; Neumark, D.M., Photodissociation Spectroscopy and Dynamics of the N2O2- Anion, J. Chem. Phys., 1996, 104, 13, 5026, https://doi.org/10.1063/1.471132 . [all data]