Bis(difluoroboryl) oxide

Gas phase thermochemistry data

Quantity Value Units Method Reference Comment
Δfgas-453.652kcal/molReviewChase, 1998Data last reviewed in June, 1971
Quantity Value Units Method Reference Comment
gas,1 bar80.669cal/mol*KReviewChase, 1998Data last reviewed in June, 1971

Gas Phase Heat Capacity (Shomate Equation)

Cp° = A + B*t + C*t2 + D*t3 + E/t2
H° − H°298.15= A*t + B*t2/2 + C*t3/3 + D*t4/4 − E/t + F − H
S° = A*ln(t) + B*t + C*t2/2 + D*t3/3 − E/(2*t2) + G
    Cp = heat capacity (cal/mol*K)
    H° = standard enthalpy (kcal/mol)
    S° = standard entropy (cal/mol*K)
    t = temperature (K) / 1000.

View plot Requires a JavaScript / HTML 5 canvas capable browser.

View table.

Temperature (K) 298. - 1100.1100. - 6000.
A 4.50282135.68389
B 62.510800.598534
C -48.46451-0.120485
D 13.855300.008311
E 0.032175-3.802431
F -457.2629-473.9720
G 69.69391110.1360
H -453.6511-453.6511
ReferenceChase, 1998Chase, 1998
Comment Data last reviewed in June, 1971 Data last reviewed in June, 1971

References

Chase, 1998
Chase, M.W., Jr., NIST-JANAF Themochemical Tables, Fourth Edition, J. Phys. Chem. Ref. Data, Monograph 9, 1998, 1-1951. [all data]