CAS Reg. No. 12509-93-2
- CAS Registry Number: 12509-93-2

Reaction thermochemistry data

Data compiled by: John E. Bartmess
Individual Reactions
CAS Reg. No. 12509-93-2 + = H2O6S-
By formula: CAS Reg. No. 12509-93-2 + H2O = H2O6S-
Quantity | Value | Units | Method | Reference | Comment |
---|---|---|---|---|---|
ΔrG° | 4.10 ± 0.20 | kcal/mol | IMRE | Möhler, Reiner, et al., 1992 | gas phase |

References

Möhler, Reiner, et al., 1992
Möhler, O.; Reiner, T.; Arnold, F.,
The Formation of SO5(-) by Gas Phase Ion-Molecule Reactions,
J. Chem. Phys., 1992, 97, 11, 8233, https://doi.org/10.1063/1.463394
. [all data]