Triphenyl phenylethynyl tin
- Formula: C26H20Sn
- Molecular weight: 451.147
- IUPAC Standard InChIKey: LQCOSCHQCHLTJW-UHFFFAOYSA-N
- CAS Registry Number: 1247-08-1
- Chemical structure:

Condensed phase thermochemistry data

Data compiled as indicated in comments:
MS - José A. Martinho Simões
DH - Eugene S. Domalski and Elizabeth D. Hearing
Quantity | Value | Units | Method | Reference | Comment |
---|---|---|---|---|---|
ΔfH°solid | 599.3 ± 8.1 | kJ/mol | Review | Martinho Simões | MS |
Quantity | Value | Units | Method | Reference | Comment |
ΔcH°solid | -14266.5 ± 7.3 | kJ/mol | CC-SB | Carson, Laye, et al., 1985 | MS |
Constant pressure heat capacity of solid
Cp,solid (J/mol*K) | Temperature (K) | Reference | Comment |
---|---|---|---|
447.5 | 298.15 | Carson, Laye, et al., 1985, 2 | Cp given as 0.992 J/g*K.; DH |

Phase change data

Data compiled by: José A. Martinho Simões
Quantity | Value | Units | Method | Reference | Comment |
---|---|---|---|---|---|
ΔsubH° | 137.6 ± 2.0 | kJ/mol | CC-SB | Carson, Laye, et al., 1985 |

Gas phase thermochemistry data

Data compiled by: José A. Martinho Simões

Quantity Value Units Method Reference Comment
Δfgas736.9 ± 8.3kJ/molReviewMartinho Simões

References

Martinho Simões
Martinho Simões, J.A.,
Private communication (see http://webbook.nist.gov/chemistry/om/). [all data]
Carson, Laye, et al., 1985
Carson, A.S.; Laye, P.G.; Spencer, J.A.,
J. Chem. Thermodyn., 1985, 17, 277. [all data]
Carson, Laye, et al., 1985, 2
Carson, A.S.; Laye, P.G.; Spencer, J.A.,
The enthalpies of formation of triphenyl vinyl tin and triphenyl phenylethynyl tin and some associated tin-carbon bond enthalpies,
J. Chem. Thermodynam., 1985, 17, 277-281. [all data]