n-Octyl α-trifluoromethylvinyl ether

Reaction thermochemistry data

Data compiled by: Hussein Y. Afeefy, Joel F. Liebman, and Stephen E. Stein

Individual Reactions

C11H19F3O + Hydrogen = Ether, octyl 2,2,2-trifluoro-1-methylethyl, (±)-

By formula: C11H19F3O + H2 = C11H21F3O

Quantity Value Units Method Reference Comment
Δr-123.kJ/molChydGajewski, Gee, et al., 1990liquid phase

References

Gajewski, Gee, et al., 1990
Gajewski, J.J.; Gee, K.R.; Jurayj, J., Energetic and rates of the trifluoromethyl group at C-2 and C-4 on the aliphatic claisen rearrangement, J. Am. Chem. Soc., 1990, 90, 1813-1822. [all data]