sodium methanolate
- Formula: CH3NaO
- Molecular weight: 54.0237
- IUPAC Standard InChIKey: WQDUMFSSJAZKTM-UHFFFAOYSA-N
- CAS Registry Number: 124-41-4
- Chemical structure:
View 3d structure (requires JavaScript / HTML 5) - Other names: Sodium methoxide

Condensed phase thermochemistry data

Data compiled as indicated in comments:
MS - José A. Martinho Simões
DH - Eugene S. Domalski and Elizabeth D. Hearing
Quantity | Value | Units | Method | Reference | Comment |
---|---|---|---|---|---|
ΔfH°solid | -375.9 ± 3.1 | kJ/mol | Review | Martinho Simões | MS |
ΔfH°solid | -372.8 ± 2.4 | kJ/mol | Review | Martinho Simões | MS |
ΔfH°solid | -374.4 ± 2.0 | kJ/mol | Review | Martinho Simões | Selected data. Average of the values from Leal, Pires de Matos, et al., 1991; MS |
Quantity | Value | Units | Method | Reference | Comment |
S°solid,1 bar | 110.58 | J/mol*K | N/A | Grenier and Westrum, 1957 | DH |
Constant pressure heat capacity of solid
Cp,solid (J/mol*K) | Temperature (K) | Reference | Comment |
---|---|---|---|
69.45 | 298.15 | Grenier and Westrum, 1957 | T = 5 to 340 K.; DH |

Reaction thermochemistry data

Data compiled by: José A. Martinho Simões
Individual Reactions
(cr) + (
• 552
) (solution) =
(l) +
(cr)
By formula: CH3NaO (cr) + (HCl • 552H2O) (solution) = CH4O (l) + ClNa (cr)
Quantity | Value | Units | Method | Reference | Comment |
---|---|---|---|---|---|
ΔrH° | -108.0 ± 3.1 | kJ/mol | RSC | Leal, Pires de Matos, et al., 1991 |
By formula: CH3NaO (cr) + H2O (l) = HNaO (cr) + CH4O (l)
Quantity | Value | Units | Method | Reference | Comment |
---|---|---|---|---|---|
ΔrH° | -6.5 ± 2.4 | kJ/mol | RSC | Leal, Pires de Matos, et al., 1991 |

References

Martinho Simões
Martinho Simões, J.A.,
Private communication (see http://webbook.nist.gov/chemistry/om/). [all data]
Leal, Pires de Matos, et al., 1991
Leal, J.P.; Pires de Matos, A.; Martinho Simões, J.A.,
J. Organometal. Chem., 1991, 403, 1. [all data]
Grenier and Westrum, 1957
Grenier, G.; Westrum, E.F., Jr.,
The low temperature heat capacity and thermodynamic properties of sodium methoxide,
J. Am. Chem. Soc., 1957, 79, 1802-1804. [all data]