Tetradecanal
- Formula: C14H28O
- Molecular weight: 212.3715
- IUPAC Standard InChIKey: UHUFTBALEZWWIH-UHFFFAOYSA-N
- CAS Registry Number: 124-25-4
- Chemical structure:
View 3d structure (requires JavaScript / HTML 5) - Other names: Myristaldehyde; Myristylaldehyde; Tetradecylaldehyde; n-Tetradecanal; Aldehyde C-14; Aldehyde C-14, myristic; C-14 Aldehyde, myristic; Myristic aldehyde; 1-Tetradecanal; 1-Tetradecyl aldehyde; NSC 66435; n-Tetradecyl aldehyde; 511542-15-7

Phase change data

Data compiled as indicated in comments:
BS - Robert L. Brown and Stephen E. Stein
TRC - Thermodynamics Research Center, NIST Boulder Laboratories, Chris Muzny director
AC - William E. Acree, Jr., James S. Chickos
Quantity | Value | Units | Method | Reference | Comment |
---|---|---|---|---|---|
Tfus | 298. | K | N/A | Escourrou, 1939 | Uncertainty assigned by TRC = 5. K; TRC |
Tfus | 295.7 | K | N/A | Uhl, 1935 | Uncertainty assigned by TRC = 2. K; TRC |
Tfus | 296. | K | N/A | Stephen, 1925 | Uncertainty assigned by TRC = 4. K; TRC |
Tfus | 296.7 | K | N/A | Le Sueur, 1905 | Uncertainty assigned by TRC = 3. K; TRC |
Tfus | 325.7 | K | N/A | Krafft, 1880 | Uncertainty assigned by TRC = 2. K; TRC |
Quantity | Value | Units | Method | Reference | Comment |
ΔvapH° | 77.4 ± 0.4 | kJ/mol | GS | Verevkin, Krasnykh, et al., 2003 | Based on data from 334. to 370. K.; AC |
ΔvapH° | 80.2 | kJ/mol | CGC | Koutek, Hoskovec, et al., 1996 | Based on data from 343. to 383. K. See also Ova, Koultek, et al., 2000.; AC |
Reduced pressure boiling point
Tboil (K) | Pressure (bar) | Reference | Comment |
---|---|---|---|
439.2 | 0.032 | Weast and Grasselli, 1989 | BS |
Enthalpy of vaporization
ΔvapH (kJ/mol) | Temperature (K) | Method | Reference | Comment |
---|---|---|---|---|
63.4 | 387. | A | Stephenson and Malanowski, 1987 | Based on data from 372. to 571. K. See also Stull, 1947.; AC |
Antoine Equation Parameters
log10(P) = A − (B / (T + C))
P = vapor pressure (bar)
T = temperature (K)
View plot Requires a JavaScript / HTML 5 canvas capable browser.
Temperature (K) | A | B | C | Reference | Comment |
---|---|---|---|---|---|
372. to 570.9 | 4.68985 | 2440.859 | -49.591 | Stull, 1947 | Coefficents calculated by NIST from author's data. |

Kovats' RI, non-polar column, isothermal

Column type | Active phase | Temperature (C) | I | Reference | Comment |
---|---|---|---|---|---|
Capillary | DB-5 | 170. | 1611. | Svatoz, Kalinová, et al., 1999 | 30. m/0.25 mm/0.25 μm |

Kovats' RI, non-polar column, temperature ramp

Column type | Active phase | I | Reference | Comment |
---|---|---|---|---|
Capillary | CP Sil 8 CB | 1609. | Tayoub, Schwob, et al., 2006 | 30. m/0.25 mm/0.25 μm, H2, 50. C @ 2. min, 3. K/min; Tend: 220. C |
Capillary | CP Sil 8 CB | 1609. | Tayoub, Schwob, et al., 2006, 2 | 30. m/0.25 mm/0.25 μm, H2, 50. C @ 2. min, 3. K/min; Tend: 220. C |
Capillary | HP-5MS | 1614. | Asuming, Beauchamp, et al., 2005 | 30. m/0.25 mm/0.25 μm, He, 50. C @ 10. min, 3. K/min, 250. C @ 5. min |
Capillary | SPB-1 | 1594. | Yadav, Chauhan, et al., 2004 | 30. m/0.32 mm/0.25 μm, He, 50. C @ 2. min, 2. K/min, 250. C @ 5. min |
Capillary | Methyl Silicone | 1621. | Jayaprakasha, Rao, et al., 2000 | 30. m/0.32 mm/0.25 μm, He, 60. C @ 2. min, 2. K/min, 225. C @ 5. min |
Capillary | DB-1 | 1592. | Takeoka, Perrino, et al., 1996 | 60. m/0.25 mm/0.25 μm, 30. C @ 4. min, 2. K/min; Tend: 220. C |
Capillary | DB-1 | 1592. | Takeoka, Perrino, et al., 1996 | 60. m/0.25 mm/0.25 μm, 30. C @ 4. min, 2. K/min; Tend: 220. C |
Capillary | DB-5 | 1618. | Ramarathnam, Rubin, et al., 1993 | He, 30. C @ 2. min, 10. K/min, 280. C @ 3. min; Column length: 30. m; Column diameter: 0.13 mm |
Capillary | DB-5 | 1618. | Ramarathnam, Rubin, et al., 1993, 2 | He, 30. C @ 2. min, 10. K/min, 280. C @ 3. min; Column length: 30. m; Column diameter: 0.13 mm |
Capillary | DB-1 | 1591. | Takeoka, Flath, et al., 1990 | 60. m/0.32 mm/0.25 μm, He, 30. C @ 4. min, 2. K/min; Tend: 210. C |
Capillary | DB-1 | 1592. | Takeoka, Flath, et al., 1990 | 60. m/0.32 mm/0.25 μm, He, 30. C @ 4. min, 2. K/min; Tend: 210. C |

Kovats' RI, non-polar column, custom temperature program

Column type | Active phase | I | Reference | Comment |
---|---|---|---|---|
Capillary | CP Sil 8 CB | 1613. | Radusiene, Judzentiene, et al., 2005 | 50. m/0.32 mm/0.25 μm, He; Program: 60C(1min) => 3C/min => 70C => 15C/min => 170C(8min) => 5C/min => 250C |
Capillary | HP-5 | 1611. | Palic, Stojanovic, et al., 2002 | 30. m/0.25 mm/0.25 μm, He; Program: 50 C 20 C/min -> 70 C 9 C/min -> 280 C |
Capillary | HP-5 | 1611. | Stojanovic, Palic, et al., 2000 | 30. m/0.25 mm/0.25 μm, He; Program: 50 0C 20 K/min -> 70 0C 9 K/min -> 280 0C |

Van Den Dool and Kratz RI, non-polar column, temperature ramp

Column type | Active phase | I | Reference | Comment |
---|---|---|---|---|
Capillary | 5 % Phenyl methyl siloxane | 1632. | Zaikin, 2010 | 30. m/0.25 mm/0.25 μm, 15. K/min, 270. C @ 15. min; Tstart: 60. C |
Capillary | HP-5MS | 1606. | Benkaci-Ali, Baaliouamer, et al., 2007 | 30. m/0.25 mm/0.25 μm, He, 60. C @ 8. min, 2. K/min, 250. C @ 30. min |
Capillary | RTX-1 | 1592. | Paolini, Muselli, et al., 2007 | 60. m/0.22 mm/0.25 μm, He, 2. K/min, 230. C @ 35. min; Tstart: 60. C |
Capillary | HP-5 | 1611. | Quijano, Salamanca, et al., 2007 | 30. m/0.25 mm/0.25 μm, He, 50. C @ 4. min, 4. K/min, 250. C @ 10. min |
Capillary | HP-5MS | 1614.5 | Zeng, Zhao, et al., 2007 | 30. m/0.25 mm/0.25 μm, He, 4. K/min; Tstart: 80. C; Tend: 300. C |
Capillary | Mega 5MS | 1581. | Condurso, Verzera, et al., 2006 | 60. m/0.25 mm/0.25 μm, He, 3. K/min; Tstart: 60. C; Tend: 240. C |
Capillary | HP-5MS | 1611. | Saroglou, Dorizas, et al., 2006 | 30. m/0.25 mm/0.25 μm, He, 60. C @ 5. min, 4. K/min; Tend: 280. C |
Capillary | HP-5 | 1613. | Xian Q., Chen H., et al., 2006 | 30. m/0.25 mm/0.25 μm, He, 3. K/min, 220. C @ 20. min; Tstart: 50. C |
Capillary | CP Sil 5 CB | 1596. | Ziegenbein, Hanssen, et al., 2006 | 25. m/0.25 mm/0.4 μm, He, 10. K/min; Tstart: 80. C; Tend: 270. C |
Capillary | DB-5 | 1615. | bin Jantan, Yalvema, et al., 2005 | 25. m/0.25 mm/0.25 μm, N2, 75. C @ 10. min, 3. K/min, 210. C @ 1. min |
Capillary | HP-5 | 1613. | Magalhães, Ruiz, et al., 2005 | 4. K/min; Column length: 30. m; Tstart: 50. C; Tend: 290. C |
Capillary | HP-5MS | 1611. | Pino, Mesa, et al., 2005 | 30. m/0.25 mm/0.25 μm, He, 60. C @ 2. min, 4. K/min, 250. C @ 20. min |
Capillary | Mega 5MS | 1605. | Verzera, Trozzi, et al., 2005 | 30. m/0.25 mm/0.25 μm, He, 40. C @ 2. min, 3. K/min; Tend: 240. C |
Capillary | HP-5MS | 1611. | Aligiannis, Kalpoutzakis, et al., 2004 | 30. m/0.25 mm/0.25 μm, He, 3. K/min; Tstart: 60. C; Tend: 280. C |
Capillary | RTX-5 | 1612. | Dugo, Mondello, et al., 2004 | 30. m/0.25 mm/0.25 μm, He, 45. C @ 6. min, 3. K/min, 300. C @ 10. min |
Capillary | SPB-1 | 1588. | Chisholm, Jell, et al., 2003 | 30. m/0.25 mm/0.25 μm, He, 35. C @ 5. min, 4. K/min, 225. C @ 20. min |
Capillary | SPB-1 | 1588. | Chisholm, Jell, et al., 2003 | 30. m/0.25 mm/0.25 μm, He, 35. C @ 5. min, 4. K/min, 225. C @ 20. min |
Capillary | SPB-1 | 1596. | Chisholm, Wilson, et al., 2003 | 25. m/0.25 mm/0.25 μm, 35. C @ 10. min, 4. K/min; Tend: 225. C |
Capillary | SPB-1 | 1595. | Chisholm, Wilson, et al., 2003 | 25. m/0.25 mm/0.25 μm, 35. C @ 10. min, 4. K/min; Tend: 225. C |
Capillary | SPB-1 | 1596. | Chisholm, Wilson, et al., 2003 | 25. m/0.25 mm/0.25 μm, 35. C @ 10. min, 4. K/min; Tend: 225. C |
Capillary | HP-5 | 1609. | Fokialakis, Melliou, et al., 2003 | 30. m/0.25 mm/0.25 μm, He, 3. K/min; Tstart: 60. C; Tend: 280. C |
Capillary | DB-5 | 1612. | Javidnia, Miri, et al., 2003 | He, 4. K/min; Column length: 25. m; Column diameter: 0.25 mm; Tstart: 60. C; Tend: 260. C |
Capillary | HP-1 | 1607. | Senatore, Rigano, et al., 2003 | 30. m/0.25 mm/0.33 μm, He, 40. C @ 5. min, 2. K/min, 260. C @ 20. min |
Capillary | HP-5 | 1609. | Skaltsa, Demetzos, et al., 2003 | 30. m/0.25 mm/0.25 μm, He, 60. C @ 5. min, 4. K/min; Tend: 280. C |
Capillary | Mega 5MS | 1605. | Verzera, Trozzi, et al., 2003 | 30. m/0.25 mm/0.25 μm, He, 40. C @ 2. min, 3. K/min; Tend: 240. C |
Capillary | DB-5 | 1613. | Choi, Kim. M.-S.L., et al., 2002 | 30. m/0.25 mm/0.25 μm, He, 70. C @ 2. min, 4. K/min, 230. C @ 20. min |
Capillary | RTX-5 | 1617. | Mondello, Zappia, et al., 2002 | 30. m/0.25 mm/0.25 μm, He, 45. C @ 6. min, 3. K/min, 300. C @ 10. min |
Capillary | SPB-1 | 1596. | Chisholm, Wilson, et al., 2001 | 15. m/0.25 mm/0.25 μm, 35. C @ 3. min, 6. K/min, 225. C @ 10. min |
Capillary | DB-5 | 1611. | Nogueira, Bittrich, et al., 2001 | 30. m/0.25 mm/0.25 μm, H2, 3. K/min; Tstart: 60. C; Tend: 240. C |
Capillary | CP Sil 8 CB | 1619. | Elmore, Mottram, et al., 2000 | 60. m/0.25 mm/0.25 μm, He, 40. C @ 2. min, 4. K/min; Tend: 280. C |
Capillary | HP-5 | 1610. | Lazari, Skaltsa, et al., 2000 | 30. m/0.25 mm/0.25 μm, He, 50. C @ 5. min, 4. K/min; Tend: 280. C |
Capillary | HP-5 | 1611. | Lazari, Skaltsa, et al., 2000, 2 | 30. m/0.25 mm/0.25 μm, He, 50. C @ 5. min, 4. K/min; Tend: 280. C |
Capillary | DB-5 | 1615. | Marques, McElfresh, et al., 2000 | 30. m/0.25 mm/0.25 μm, 100. C @ 1. min, 5. K/min, 275. C @ 3. min |
Capillary | Mega 5MS | 1605. | Verzera, la Rosa, et al., 2000 | 30. m/0.25 mm/0.25 μm, He, 40. C @ 2. min, 3. K/min; Tend: 240. C |
Capillary | Mega 5MS | 1605. | Verzera, Trozzi, et al., 2000 | 30. m/0.25 mm/0.25 μm, He, 40. C @ 2. min, 3. K/min; Tend: 240. C |
Capillary | HP-5 | 1609. | Lazari, Skaltsa, et al., 1999 | 30. m/0.25 mm/0.25 μm, He, 50. C @ 5. min, 4. K/min; Tend: 280. C |
Capillary | BP-1 | 1593. | Sinyinda and Gramshaw, 1998 | He, 5. C @ 5. min, 5. K/min, 250. C @ 30. min; Column length: 25. m; Column diameter: 0.32 mm |
Capillary | OV-101 | 1591. | Yang, Sugisawa, et al., 1992 | N2, 2. K/min; Column length: 50. m; Column diameter: 0.25 mm; Tstart: 80. C; Tend: 200. C |
Capillary | OV-101 | 1592. | Yang, Sugisawa, et al., 1992 | N2, 2. K/min; Column length: 50. m; Column diameter: 0.25 mm; Tstart: 80. C; Tend: 200. C |

Van Den Dool and Kratz RI, non-polar column, custom temperature program

Column type | Active phase | I | Reference | Comment |
---|---|---|---|---|
Capillary | DB-5 | 1607. | Özel, Gögüs, et al., 2006 | Program: not specified |
Capillary | DB-5MS | 1625. | Varlet V., Knockaert C., et al., 2006 | 30. m/0.32 mm/0.5 μm, He; Program: 70C(1min) => 3C/min => 80C(1min) => 5C/min => 150C => 10C/min => 280C (4min) |
Capillary | SE-52 | 1600. | Frizzo, Lorenzo, et al., 2004 | 25. m/0.32 mm/0.43 μm, H2; Program: 60C(8min) => 3C/min => 180C => 20C/min => 250C(10min) |
Capillary | DB-5 | 1614. | Beaulieu and Grimm, 2001 | 30. m/0.25 mm/0.25 μm, He; Program: 50C (1min) => 5C/min => 100C => 10C/min => 250C (9min) |
Capillary | BPX-5 | 1624. | Owens J.D., Allagheny N., et al., 1997 | 50. m/0.32 mm/0.5 μm, He; Program: OC => 60C/min => 60C(5min) => 4C/min => 250C(20min) |
Capillary | SE-52 | 1611. | Mondello, Dugo, et al., 1995 | 60. m/0.32 mm/0.40 μm, He; Program: 45 C (6 min) 3 C/min -> 111 0C 2 C/min -> 160 C 3 C/min -> 300 C (15 min) |

Van Den Dool and Kratz RI, polar column, temperature ramp

Column type | Active phase | I | Reference | Comment |
---|---|---|---|---|
Capillary | RTX-Wax | 1919. | Paolini, Muselli, et al., 2007 | 60. m/0.22 mm/0.25 μm, He, 2. K/min, 230. C @ 35. min; Tstart: 60. C |
Capillary | DB-Wax | 1924. | Choi, 2005 | 60. m/0.25 mm/0.25 μm, N2, 70. C @ 2. min, 2. K/min, 230. C @ 20. min |
Capillary | DB-Wax | 1921. | Njoroge, Koaze, et al., 2005 | 60. m/0.25 mm/0.25 μm, N2, 70. C @ 2. min, 2. K/min, 230. C @ 20. min |
Capillary | Innowax | 1927. | Chisholm, Jell, et al., 2003 | 15. m/0.25 mm/0.25 μm, He, 35. C @ 5. min, 4. K/min, 225. C @ 20. min |
Capillary | Supelcowax | 1940. | Chisholm, Wilson, et al., 2003 | 25. m/0.25 mm/0.25 μm, 35. C @ 5. min, 4. K/min, 225. C @ 10. min |
Capillary | Supelcowax | 1940. | Chisholm, Wilson, et al., 2003 | 25. m/0.25 mm/0.25 μm, 35. C @ 5. min, 4. K/min, 225. C @ 10. min |
Capillary | Supelcowax | 1940. | Chisholm, Wilson, et al., 2003 | 25. m/0.25 mm/0.25 μm, 35. C @ 5. min, 4. K/min, 225. C @ 10. min |
Capillary | Supelcowax | 1943. | Chisholm, Wilson, et al., 2003 | 25. m/0.25 mm/0.25 μm, 35. C @ 5. min, 4. K/min, 225. C @ 10. min |
Capillary | DB-Wax | 1908. | Choi, Kim. M.-S.L., et al., 2002 | 60. m/0.25 mm/0.25 μm, N2, 2. K/min, 230. C @ 20. min; Tstart: 70. C |
Capillary | CP-Wax 52CB | 1908. | Liu, Yang, et al., 2001 | H2, 2. K/min; Column length: 50. m; Column diameter: 0.32 mm; Tstart: 50. C; Tend: 200. C |
Capillary | DB-Wax | 1929. | Choi and Sawamura, 2000 | 60. m/0.25 mm/0.25 μm, N2, 70. C @ 2. min, 2. K/min, 230. C @ 20. min |
Capillary | DB-Wax | 1910. | Marques, McElfresh, et al., 2000 | 30. m/0.32 mm/0.25 μm, 100. C @ 1. min, 5. K/min; Tend: 240. C |
Capillary | Carbowax 20M | 1920. | Mondello, Dugo, et al., 1995 | 60. m/0.32 mm/0.425 μm, He, 45. C @ 3. min, 3. K/min, 300. C @ 20. min |
Capillary | DB-Wax | 1927. | Shiratsuchi, Shimoda, et al., 1994 | 60. m/0.25 mm/0.25 μm, 2. K/min, 230. C @ 60. min; Tstart: 50. C |
Capillary | DB-Wax | 1927. | Shiratsuchi, Shimoda, et al., 1994, 2 | 60. m/0.25 mm/0.25 μm, He, 2. K/min, 230. C @ 60. min; Tstart: 50. C |

Van Den Dool and Kratz RI, polar column, custom temperature program

Column type | Active phase | I | Reference | Comment |
---|---|---|---|---|
Capillary | Supelcowax-10 | 1940. | Chisholm, Wilson, et al., 2001 | Program: not specified |

Normal alkane RI, non-polar column, temperature ramp

Column type | Active phase | I | Reference | Comment |
---|---|---|---|---|
Capillary | Elite-5 MS | 1614. | Baharum, Bunawan, et al., 2010 | 30. m/0.25 mm/0.25 μm, Helium, 4. K/min; Tstart: 40. C; Tend: 220. C |
Capillary | HP-5 | 1613. | Bi Kouame, Bedi, et al., 2010 | 30. m/0.25 mm/0.25 μm, Helium, 50. C @ 5. min, 50. K/min, 300. C @ 5. min |
Capillary | HP-5 | 1613. | Kahriman, Tosun, et al., 2010 | 30. m/0.32 mm/0.25 μm, Helium, 60. C @ 2. min, 3. K/min; Tend: 240. C |
Capillary | HP-5 MS | 1614. | Ogunwande, Flamini, et al., 2010 | 30. m/0.25 mm/0.25 μm, Helium, 60. C @ 10. min, 5. K/min; Tend: 220. C |
Capillary | HP-5 MS | 1614. | Radulovic, Blagojevic, et al., 2010 | 30. m/0.25 mm/0.25 μm, Helium, 5. K/min, 290. C @ 10. min; Tstart: 70. C |
Capillary | HP-5 | 1615. | Radulovic, Dordevic, et al., 2010 | 30. m/0.25 mm/0.25 μm, Hydrogen, 5. K/min; Tstart: 70. C; Tend: 290. C |
Capillary | DB-5 MS | 1613. | Silva, Pott, et al., 2010 | 30. m/0.25 mm/0.25 μm, Helium, 3. K/min; Tstart: 60. C; Tend: 240. C |
Capillary | DB-5 | 1613. | Ho, Wang, et al., 2009 | 30. m/0.25 mm/0.25 μm, Helium, 50. C @ 2. min, 5. K/min; Tend: 250. C |
Capillary | DB-5 | 1613. | Scrivanti, Anton, et al., 2009 | 30. m/0.25 mm/0.25 μm, Nitrogen, 2. K/min; Tstart: 40. C; Tend: 230. C |
Capillary | HP-1 | 1593. | Wetwiayaklung, Thavanapong, et al., 2009 | 25. m/0.32 mm/0.17 μm, 50. C @ 5. min, 1. K/min, 260. C @ 5. min |
Capillary | HP-5 MS | 1613. | Forero, Quijano, et al., 2008 | 30. m/0.25 mm/0.25 μm, Helium, 50. C @ 4. min, 4. K/min, 230. C @ 10. min |
Capillary | SLB-5 MS | 1614. | Lo Presti, Sciarrone, et al., 2008 | 30. m/0.25 mm/0.25 μm, Helium, 50. C @ 2. min, 3. K/min, 250. C @ 10. min |
Capillary | HP-5 | 1610. | Saidana, Mahjoub, et al., 2008 | 30. m/0.25 mm/0.25 μm, Nitrogen, 50. C @ 1. min, 5. K/min, 280. C @ 1. min |
Capillary | HP-5 | 1614. | Asekun, Olusegun, et al., 2007 | He, 5. K/min; Column length: 30. m; Column diameter: 0.25 mm; Tstart: 70. C; Tend: 240. C |
Capillary | DB-5MS | 1579. | Marongiu B., Piras A., et al., 2007 | 30. m/0.25 mm/0.25 μm, He, 3. K/min, 280. C @ 30. min; Tstart: 60. C |
Capillary | HP-5 | 1609. | Pavlovic, Petrovic, et al., 2007 | 25. m/0.32 mm/0.52 μm, Helium, 4. K/min; Tstart: 40. C; Tend: 280. C |
Capillary | HP-5 MS | 1617. | Phutdhawong, Kawaree, et al., 2007 | 25. m/0.25 mm/0.25 μm, Helium, 100. C @ 3. min, 4. K/min, 280. C @ 5. min |
Capillary | DB-5 | 1623. | Najafpour Navaei, Mirza, et al., 2006 | 30. m/0.25 mm/0.25 μm, He, 4. K/min; Tstart: 50. C; Tend: 250. C |
Capillary | NB-30 | 1600. | Orav, Raal, et al., 2006 | 30. m/0.2 mm/0.25 μm, He, 2. K/min; Tstart: 50. C; Tend: 250. C |
Capillary | PE-5 | 1610. | Pandey-Rai S., Mallavarapu G.R., et al., 2006 | 50. m/0.32 mm/0.25 μm, He, 100. C @ 1. min, 3. K/min; Tend: 280. C |
Capillary | HP-5 | 1613. | Pino, Sauri-Duch, et al., 2006 | 30. m/0.25 mm/0.25 μm, H2, 50. C @ 2. min, 4. K/min, 280. C @ 10. min |
Capillary | DB-5 MS | 1618. | Schirack, Drake, et al., 2006 | 30. m/0.25 mm/0.25 μm, 40. C @ 3. min, 8. K/min, 200. C @ 20. min |
Capillary | DB-5MS | 1576. | Marongiu, Piras, et al., 2005 | 30. m/0.25 mm/0.25 μm, He, 60. C @ 30. min, 3. K/min; Tend: 280. C |
Capillary | CP Sil 5 CB | 1613. | Rohloff and Bones, 2005 | 30. m/0.25 mm/0.25 μm, He, 40. C @ 1. min, 4. K/min; Tend: 220. C |
Capillary | CP Sil 5 CB | 1613. | Rohloff and Bones, 2005 | 30. m/0.25 mm/0.25 μm, He, 40. C @ 1. min, 4. K/min; Tend: 220. C |
Capillary | DB-5 | 1608. | Senatore, Apostolides Arnold, et al., 2005 | 30. m/0.25 mm/0.25 μm, He, 40. C @ 5. min, 2. K/min, 260. C @ 20. min |
Capillary | DB-1 | 1617. | bin Jantan, Ayop, et al., 2004 | 25. m/0.25 mm/0.25 μm, 60. C @ 10. min, 3. K/min, 180. C @ 10. min |
Capillary | HP-5MS | 1621. | Malencic, Couladis, et al., 2004 | 30. m/0.25 mm/0.25 μm, He, 3. K/min; Tstart: 60. C; Tend: 280. C |
Capillary | DB-1 | 1586. | Sarkhail, Amin, et al., 2004 | 30. m/0.25 mm/0.25 μm, He, 50. C @ 1. min, 2.5 K/min, 265. C @ 20. min |
Capillary | DB-5 | 1610. | Dhanda, Pegg, et al., 2003 | 60. m/0.25 mm/0.25 μm, He, 35. C @ 2. min, 5. K/min, 280. C @ 4. min |
Capillary | HP-5 | 1607. | Sajjadi and Mehregan, 2003 | 30. m/0.25 mm/0.25 μm, He, 4. K/min; Tstart: 60. C; Tend: 280. C |
Capillary | HP-1 | 1586. | Valette, Fernandez, et al., 2003 | 50. m/0.2 mm/0.5 μm, He, 2. K/min, 220. C @ 40. min; Tstart: 60. C |
Capillary | DB-1 | 1584. | Gancel, Ollé, et al., 2002 | 30. m/0.32 mm/0.25 μm, H2, 40. C @ 20. min, 3. K/min; Tend: 245. C |
Capillary | DB-5 | 1606. | Limberger, Simões-Pires, et al., 2002 | 30. m/0.25 mm/0.25 μm, He, 3. K/min; Tstart: 60. C; Tend: 250. C |
Capillary | DB-5 | 1607. | Ruberto, Biondi, et al., 2002 | 30. m/0.25 mm/0.25 μm, He, 2. K/min; Tstart: 60. C; Tend: 300. C |
Capillary | HP-5 | 1611. | Velickovic, Randjelovic, et al., 2002 | 30. m/0.25 mm/0.25 μm, H2, 4. K/min; Tstart: 40. C; Tend: 280. C |
Capillary | SPB-5 | 1616. | Poligné, Collignan, et al., 2001 | 60. m/0.32 mm/1. μm, He, 3. K/min; Tstart: 40. C; Tend: 200. C |
Capillary | DB-5 | 1610.8 | Svatos, Kalinová, et al., 2001 | 30. m/0.25 mm/0.25 μm, 5. K/min; Tstart: 140. C; Tend: 240. C |
Capillary | OV-101 | 1592. | Yang, 2001 | N2, 2. K/min; Column length: 50. m; Column diameter: 0.25 mm; Tstart: 80. C; Tend: 200. C |
Capillary | Ultra-2 | 1619. | King, Matthews, et al., 1995 | 50. m/0.32 mm/0.52 μm, He, 40. C @ 3. min, 4. K/min, 250. C @ 30. min |
Capillary | Cross-Linked Methylsilicone | 1584. | Bravo and Hotchkiss, 1993 | He, 35. C @ 3. min, 4. K/min; Column length: 25. m; Column diameter: 0.32 mm; Tend: 225. C |
Capillary | Ultra-2 | 1614. | King, Hamilton, et al., 1993 | 50. m/0.32 mm/0.52 μm, He, 40. C @ 3. min, 4. K/min, 250. C @ 30. min |
Capillary | OV-101 | 1591. | Tamura, Yang, et al., 1993 | 2. K/min; Column length: 50. m; Column diameter: 0.25 mm; Tstart: 80. C; Tend: 200. C |
Capillary | OV-101 | 1592. | Tamura, Yang, et al., 1993 | 2. K/min; Column length: 50. m; Column diameter: 0.25 mm; Tstart: 80. C; Tend: 200. C |
Capillary | DB-5 | 1610. | Berdague, Denoyer, et al., 1991 | 60. m/0.32 mm/1.0 μm, He, 3. K/min; Tstart: 40. C; Tend: 240. C |
Capillary | DB-5 | 1614. | Lee, Macku, et al., 1991 | 60. m/0.25 mm/0.25 μm, 40. C @ 5. min, 2. K/min; Tend: 250. C |
Capillary | CP Sil 8 CB | 1579. | Jantan and Goh, 1990 | 60. C @ 10. min, 3. K/min; Column length: 25. m; Column diameter: 0.20 mm; Tend: 230. C |
Capillary | OV-101 | 1591. | Sugisawa, Nakamura, et al., 1990 | Nitrogen, 2. K/min; Column length: 50. m; Column diameter: 0.25 mm; Tstart: 70. C; Tend: 200. C |
Capillary | OV-101 | 1595. | Sugisawa, Nakamura, et al., 1990 | Nitrogen, 2. K/min; Column length: 50. m; Column diameter: 0.25 mm; Tstart: 80. C; Tend: 200. C |
Capillary | OV-101 | 1591. | Yang and Sugisawa, 1990 | N2, 2. K/min; Column length: 50. m; Column diameter: 0.25 mm; Tstart: 80. C; Tend: 200. C |
Capillary | OV-101 | 1591. | Yang and Sugisawa, 1990 | N2, 2. K/min; Column length: 50. m; Column diameter: 0.25 mm; Tstart: 80. C; Tend: 200. C |
Capillary | OV-101 | 1591. | Sugisawa, Yamamoto, et al., 1989 | N2, 2. K/min; Column length: 50. m; Column diameter: 0.25 mm; Tstart: 80. C; Tend: 200. C |
Capillary | OV-101 | 1593. | Sugisawa, Yang, et al., 1989 | N2, 2. K/min; Column length: 50. m; Column diameter: 0.25 mm; Tstart: 80. C; Tend: 200. C |
Capillary | OV-101 | 1594. | Sugisawa, Yang, et al., 1989 | N2, 2. K/min; Column length: 50. m; Column diameter: 0.25 mm; Tstart: 80. C; Tend: 200. C |
Capillary | OV-101 | 1592. | Stern, Flath, et al., 1985 | 40. C @ 0.1 min, 4. K/min, 225. C @ 30. min; Column length: 50. m; Column diameter: 0.32 mm |
Capillary | OV-101 | 1591. | Stern, Flath, et al., 1985 | 50. C @ 0.1 min, 4. K/min, 225. C @ 30. min; Column length: 50. m; Column diameter: 0.32 mm |
Capillary | Methyl Silicone | 1592. | Lorenz, Stern, et al., 1983 | 4. K/min, 225. C @ 20. min; Column length: 25. m; Column diameter: 0.2 mm; Tstart: 80. C |
Capillary | Methyl Silicone | 1595. | Lorenz, Stern, et al., 1983 | 4. K/min, 225. C @ 20. min; Column length: 25. m; Column diameter: 0.2 mm; Tstart: 80. C |

Normal alkane RI, non-polar column, custom temperature program

Column type | Active phase | I | Reference | Comment |
---|---|---|---|---|
Capillary | SLB-5 MS | 1611. | Mondello, 2012 | 30. m/0.25 mm/0.25 μm, Helium; Program: not specified |
Capillary | SLB-5 MS | 1615. | Mondello, 2012 | 30. m/0.25 mm/0.25 μm, Helium; Program: not specified |
Capillary | Siloxane, 5 % Ph | 1629. | VOC BinBase, 2012 | Program: not specified |
Capillary | 1607. | Karimi, Farmany, et al., 2011 | Program: not specified | |
Capillary | HP-5 MS | 1612. | Payo, Colo, et al., 2011 | Program: not specified |
Capillary | HP-5 MS | 1613. | Payo, Colo, et al., 2011 | Program: not specified |
Capillary | Polydimethyl siloxane, 5 % phenyl | 1629. | Skogerson, Wohlgemuth, et al., 2011 | Program: not specified |
Capillary | HP-5 | 1613. | Bi Kouame, Bedi, et al., 2010 | 30. m/0.25 mm/0.25 μm, Helium; Program: not specified |
Capillary | HP-5 | 1613. | Kahriman, Tosun, et al., 2010 | 30. m/0.32 mm/0.25 μm, Helium; Program: not specified |
Capillary | ZB-1 MS | 1601. | Al-Reza, Rahman, et al., 2009 | 30. m/0.25 mm/0.25 μm, Helium; Program: 50 0C 3 0C/min -> 150 0C (10 min) 10 0C/min -> 250 0C |
Capillary | RTX-5 | 1614. | Leela, Vipin, et al., 2009 | 30. m/0.25 mm/0.25 μm, Nitrogen; Program: 60 0C 95 min) 110 0C 3 0C/min -> 200 0C 5 0C/min -> 220 0C 95 min) |
Capillary | RTX-5 | 1611. | Leela, Vipin, et al., 2009 | 30. m/0.25 mm/0.25 μm, Nitrogen; Program: not specified |
Capillary | BPX-5 | 1622. | se Souza, Cardeal, et al., 2009 | 30. m/0.25 mm/0.25 μm, Helium; Program: 35 0C (5 min) 3 0C/min -> 210 0C 40 0C/min -> 240 0C (10 min) |
Capillary | BPX-5 | 1618. | se Souza, Cardeal, et al., 2009 | 30. m/0.25 mm/0.25 μm, Helium; Program: not specified |
Capillary | HP-1 | 1593. | Wetwiayaklung, Thavanapong, et al., 2009 | 25. m/0.32 mm/0.17 μm; Program: not specified |
Capillary | DB-5 | 1611. | Judzentiene and Budiene, 2008 | 50. m/0.32 mm/0.25 μm, Helium; Program: 60 0C (2 min) 5 0C/min -> 160 0C (1 min) 10 0C/min -> 250 0C (3 min) |
Capillary | SLB-5 MS | 1614. | Lo Presti, Sciarrone, et al., 2008 | 30. m/0.25 mm/0.25 μm, Helium; Program: not specified |
Capillary | HP-5 | 1611. | Ventanas, Estevez, et al., 2008 | 50. m/0.32 mm/1.05 μm, Helium; Program: 40 0C (10 min) 5 0C/min -> 200 0C 15 0C/min -> 250 0C (10 min) |
Capillary | HP-5 MS | 1601. | Xie, Sun, et al., 2008 | 30. m/0.25 mm/0.25 μm, Helium; Program: 40 0C (2 min) 4 0C/min -> 220 0C 20 0C/min -> 280 0C |
Capillary | HP-5 MS | 1608. | Xie, Sun, et al., 2008 | 30. m/0.25 mm/0.25 μm, Helium; Program: 40 0C (2 min) 4 0C/min -> 220 0C 20 0C/min -> 280 0C |
Capillary | DB-5 MS | 1617. | Liu, Xu, et al., 2007 | 60. m/0.32 mm/1.0 μm, Helium; Program: 40 0C (2 min) 6 0C/min -> 100 0C 4 0C/min -> 180 0C 8 0C/min -> 250 0C (12 min) |
Capillary | DB-5 | 1613. | Nivinsliene, Butkiene, et al., 2007 | 50. m/0.32 mm/0.25 μm, Helium; Program: 60 0C (1 min) 5 0C/min -> 160 0C 10 0C/min -> 250 0C |
Capillary | HP-5 | 1613. | Pavlovic, Petrovic, et al., 2007 | 25. m/0.32 mm/0.52 μm, Helium; Program: not specified |
Capillary | HP-5 MS | 1615. | Setzer, Stokes, et al., 2007 | Helium; Column length: 30. m; Column diameter: 0.25 mm; Program: 40 0C (10 min) 3 oC/min -> 200 0C 2 0C/min -> 220 0C |
Capillary | HP-5 MS | 1622. | Pyun and Shin, 2006 | 30. m/0.25 mm/0.25 μm; Program: 40 0C (3 min) 2 0C/min -> 150 0C 20 0C/min -> 220 0C (5 min) |
Capillary | HP-5 MS | 1613. | Xian, Chen, et al., 2006 | 30. m/0.25 mm/0.25 μm, Helium; Program: 40 0C (3 min) 6 0C/min -> 150 0C (1 min) 10 0C/min -> 250 0C (10 min) |
Capillary | BP-5 | 1625. | Eyres, Dufour, et al., 2005 | 25. m/0.32 mm/0.50 μm, Helium; Program: 60 0C 6 0C/min -> 210 0C 10 0C/min -> 290 0C (10 min) |
Capillary | BP-5 | 1616. | Eyres, Dufour, et al., 2005 | 25. m/0.32 mm/0.50 μm, Helium; Program: not specified |
Capillary | DB-5 | 1611. | Kalinová, Svatos, et al., 2003 | 30. m/0.25 mm/0.25 μm, He; Program: 70 0C (2 min) 4 K/min -> 140 0C 5 K/min -> 220 0C 20 K/min -> 280 0C (5 min) |
Capillary | CP-Sil 8CB-MS | 1611. | Mockute, Bernotiene, et al., 2003 | Column length: 50. m; Column diameter: 0.32 mm; Program: 60C(1min) => 3C/min => 70C => 15C/min => 170C(8min) => 5C/min => 250C |
Capillary | HP-5MS | 1615. | Ansorena, Gimeno, et al., 2001 | 30. m/0.25 mm/0.25 μm, He; Program: 40C (10min) => 3C/min => 120C => 10C/min => 250C (5min) |
Capillary | HP-5 | 1615. | Ansorena, Astiasarán, et al., 2000 | 30. m/0.25 mm/0.25 μm, He; Program: 40C (10min) => 3C/min => 120C => 10C/min => 250C (5min) |
Capillary | BPX-5 | 1623. | Madruga, Arruda, et al., 2000 | 50. m/0.32 mm/0.50 μm, Helium; Program: 40 0C (5 min) 20 0C/min -> 60 0C (5 min) 4 0C/min -> 250 0C (10 min) |
Capillary | HP-1 | 1590. | Wakamura, Hattori, et al., 1999 | 15. m/0.25 mm/0.25 μm, He; Program: 50 0C (1 min) 20 0C/min -> 100 0C 5 0C/min -> 230 0C (5 min) |
Capillary | CP Sil 5 CB | 1589. | Weyerstahl, Marschall, et al., 1998 | He; Column length: 25. m; Phase thickness: 0.39 μm; Program: not specified |

Normal alkane RI, polar column, temperature ramp

Column type | Active phase | I | Reference | Comment |
---|---|---|---|---|
Capillary | DB-Wax | 1931. | Schirack, Drake, et al., 2006 | 30. m/0.25 mm/0.25 μm, 40. C @ 3. min, 8. K/min, 200. C @ 20. min |
Capillary | Innowax | 1932. | Bendimerad and Bendiab, 2005 | 50. m/0.2 mm/0.5 μm, He, 2. K/min, 250. C @ 60. min; Tstart: 60. C |
Capillary | DB-Wax | 1923. | Njoroge, Koaze, et al., 2005, 2 | 60. m/0.25 mm/0.25 μm, N2, 70. C @ 2. min, 2. K/min, 230. C @ 20. min |
Capillary | DB-Wax | 1923. | Njoroge, Koaze, et al., 2005, 3 | 60. m/0.25 mm/0.25 μm, N2, 70. C @ 2. min, 2. K/min, 230. C @ 20. min |
Capillary | Supelcowax-10 | 1947. | Rochat and Chaintreau, 2005 | 60. m/0.53 mm/1. μm, He, 40. C @ 2. min, 4. K/min, 240. C @ 20. min |
Capillary | Supelcowax-10 | 1948. | Rochat and Chaintreau, 2005 | 60. m/0.53 mm/1. μm, He, 40. C @ 2. min, 4. K/min, 240. C @ 20. min |
Capillary | DB-Wax | 1939. | Choi, 2004 | 60. m/0.25 mm/0.25 μm, N2, 70. C @ 2. min, 2. K/min, 230. C @ 20. min |
Capillary | DB-Wax | 1911. | Gancel, Ollé, et al., 2002 | 60. m/0.32 mm/0.25 μm, H2, 1.5 K/min, 245. C @ 20. min; Tstart: 40. C |
Capillary | DB-Wax | 1935. | Tu, Onishi, et al., 2002 | 60. m/0.25 mm/0.25 μm, N2, 70. C @ 2. min, 2. K/min, 230. C @ 20. min |
Capillary | HP Innowax FSP | 1933. | Kaya, Baser, et al., 1999 | 60. m/0.25 mm/0.25 μm, He, 60. C @ 10. min, 220. C @ 10. min |
Capillary | Innowax | 1933. | Kaya, Baser, et al., 1999, 2 | 60. m/0.25 mm/0.25 μm, He, 60. C @ 10. min; Tend: 220. C |

Normal alkane RI, polar column, custom temperature program

Column type | Active phase | I | Reference | Comment |
---|---|---|---|---|
Capillary | Innowax FSC | 1933. | Akin, Saracoglu, et al., 2012 | 60. m/0.25 mm/0.25 μm, Helium; Program: 60 0C (10 min) 4 0C/min -> 220 0C (10 min) 1 oC/min -> 240 0C |
Capillary | HP-FFAP | 1937. | Toontom, Meenune, et al., 2012 | 25. m/0.32 mm/0.50 μm, Helium; Program: 45 0C (2 min) 3 0C/min -> 130 0C (1 min) 20 0C/min -> 220 0C (3 min) 20 0C/min -> 230 0C (3 min) |
Capillary | Innowax | 1935. | Noorizadeh, Farmany, et al., 2011 | 60. m/0.25 mm/0.33 μm; Program: not specified |
Capillary | HP Innowax FSP | 1933. | Tabanca N., Demirci B., et al., 2007 | 60. m/0.25 mm/0.25 μm, N2; Program: 60C(10min) => 4C/min => 220C(10min) => 1C/min => 240C |
Capillary | Innowax FSC | 1933. | Baser, Özek, et al., 2006 | 60. m/0.25 mm/0.25 μm, He; Program: 60C(10min) => 4C/min >220C (10min) => 1C/min => 240C |
Capillary | Innowax FSC | 1933. | Baser, Özek, et al., 2006 | 60. m/0.25 mm/0.25 μm, He; Program: 60C(10min) => 4C/min >220C (10min) => 1C/min => 240C |
Capillary | HP-Innowax FSC | 1933. | Kürkçüoglu, Hüsnü Can Baser, et al., 2006 | 60. m/0.25 mm/0.25 μm, He; Program: 60C(10min) => 4C/min => 220C (10min) => 1C/min => 240C |
Capillary | HP-Innowax FSC | 1933. | Tabanca, Demirci, et al., 2006 | 60. m/0.25 mm/0.25 μm; Program: 60C(10min) => 4C/min => 220C (10min) => 1C/min => 240C |
Capillary | HP-Innowax FSC | 1933. | Tunalier, Candan, et al., 2006 | 60. m/0.25 mm/0.25 μm, N2; Program: 60C(10min) => 4C/min => 220C(10min) => 1C/min => 240C |
Capillary | HP-Innowax | 1933. | Duman, Kartal, et al., 2005 | 60. m/0.25 mm/0.25 μm, N2; Program: 60C(10min) => 4C/min => 220C(10min) => 1C/min => 240C |
Capillary | HP Innowax FSP | 1933. | Altintas, Kose, et al., 2004 | 60. m/0.25 mm/0.25 μm, N2; Program: 60C(10min) => 4C/min => 220C(10min) => 1C/min => 240C |
Capillary | Innowax FSC | 1933. | Baser, Özek, et al., 2004 | 60. m/0.25 mm/0.25 μm, He; Program: 60C(10min) => 4C/min => 220C(10min) => 1C/min => 240C |
Capillary | Innowax FSC | 1933. | Demirci and Baser, 2003 | 60. m/0.25 mm/0.25 μm, He; Program: 60C (10min) => 4C/min => 220C (10min) => 1C/min => 240C |
Capillary | HP-Innowax FSC | 1933. | Erdemoglu, Sener, et al., 2003 | 60. m/0.25 mm/0.25 μm, He; Program: 60C(10min) => 4C/min => 220C(10min) => 1C/min => 240C |
Capillary | Innowax FSC | 1933. | Tabanca N., Demirci F., et al., 2001 | 60. m/0.25 mm/0.25 μm, He; Program: 60C(10min) => 4C/min => 220C(10min) => 1C/min => 240C |
Capillary | Innowax | 1933. | Baser, Tabanca, et al., 2000 | 60. m/0.25 mm/0.25 μm, He; Program: 60 0C (10 min) 4 K/min -> 220 0C (10 min) 1 K/min -> 240 0C |
Capillary | Innowax FSC | 1937. | Kirimer, Tabanca, et al., 2000 | 60. m/0.25 mm/0.25 μm, He; Program: 60C(10 min) => 4C/min => 220C(10min) => 1C/min => 240C |
Capillary | DB-Wax | 1930. | Wakamura, Hattori, et al., 1999 | 30. m/0.25 mm/0.25 μm, He; Program: 50 0C (1 min) 20 0C/min -> 100 0C 5 0C/min -> 230 0C (5 min) |
Capillary | Innowax | 1933. | Baser, Kürkcüoglu, et al., 1998 | 60. m/0.25 mm/0.25 μm; Program: 60C(10min) => 4C/min => 220C(10min) => 1C/min => 240C |
Capillary | DB-Wax | 1900. | Weyerstahl, Marschall, et al., 1998 | N2; Column length: 60. m; Phase thickness: 0.25 μm; Program: not specified |
Capillary | NB-351 | 1906. | Kerrola and Kallio, 1994 | 25. m/0.32 mm/0.2 μm, He; Program: 35C(5min) => 2.5C/min => 150C => 5C/min => 240C (20min) |

Lee's RI, non-polar column, temperature ramp

Column type | Active phase | I | Reference | Comment |
---|---|---|---|---|
Capillary | DB-5 | 278.4 | Donnelly, Abdel-Hamid, et al., 1993 | 30. m/0.32 mm/0.25 μm, He, 40. C @ 3. min, 8. K/min, 285. C @ 29.5 min |

Lee's RI, non-polar column, custom temperature program

Column type | Active phase | I | Reference | Comment |
---|---|---|---|---|
Capillary | Polydimethyl siloxanes | 278.43 | Eckel and Kind, 2003 | Program: not specified |

References

Escourrou, 1939
Escourrou, R.,
Bull. Soc. Chim. Fr., 1939, 6, 1173. [all data]
Uhl, 1935
Uhl, A.H.,
J. Am. Pharm. Assoc., 1935, 24, 380. [all data]
Stephen, 1925
Stephen, H.,
J. Chem. Soc., 1925, 127, 1874. [all data]
Le Sueur, 1905
Le Sueur, H.R.,
J. Chem. Soc., 1905, 87, 1888. [all data]
Krafft, 1880
Krafft, F.,
The production of laurinaldehyde c(12)h(24)o, myristinaldehyde c(14)h(28)o, palmitinaldehyde c(16)h(32)o, stearinaldehyde c(18)h(36)o: I investigation of aldehydes,
Ber. Dtsch. Chem. Ges., 1880, 13, 1413-8. [all data]
Verevkin, Krasnykh, et al., 2003
Verevkin, Sergey P.; Krasnykh, Eugen L.; Vasiltsova, Tatiana V.; Koutek, Bohumir; Doubsky, Jan; Heintz, Andreas,
Vapor pressures and enthalpies of vaporization of a series of the linear aliphatic aldehydes,
Fluid Phase Equilibria, 2003, 206, 1-2, 331-339, https://doi.org/10.1016/S0378-3812(03)00035-9
. [all data]
Koutek, Hoskovec, et al., 1996
Koutek, Bohumir; Hoskovec, Michal; Vrkocov, Pavlína; Konecný, Karel; Feltl, Ladislav; Vrkoc, Jan,
Gas chromatographic determination of vapour pressures of pheromone-like compounds III. Aldehydes,
Journal of Chromatography A, 1996, 719, 2, 391-400, https://doi.org/10.1016/0021-9673(95)00740-7
. [all data]
Ova, Koultek, et al., 2000
Ova, P.V.; Koultek, B.; Hoskovec, M.,
Practice Oriented Results on Use and Production of Neem Ingredients and Pheromones VI, H. Kleeberg and C.P.W. Zebitz, ed(s)., Druck and Graphic, Giessen, 2000, 211-218. [all data]
Weast and Grasselli, 1989
CRC Handbook of Data on Organic Compounds, 2nd Editon, Weast,R.C and Grasselli, J.G., ed(s)., CRC Press, Inc., Boca Raton, FL, 1989, 1. [all data]
Stephenson and Malanowski, 1987
Stephenson, Richard M.; Malanowski, Stanislaw,
Handbook of the Thermodynamics of Organic Compounds, 1987, https://doi.org/10.1007/978-94-009-3173-2
. [all data]
Stull, 1947
Stull, Daniel R.,
Vapor Pressure of Pure Substances. Organic and Inorganic Compounds,
Ind. Eng. Chem., 1947, 39, 4, 517-540, https://doi.org/10.1021/ie50448a022
. [all data]